Microsoft MVP성태의 닷넷 이야기
글쓴 사람
정성태 (kevin13@chol.net)
홈페이지
첨부 파일
 

vcpkg - "Building vcpkg.exe failed. Please ensure you have installed Visual Studio with the Desktop C++ workload and the Windows SDK for Desktop C++"

이 오류의 원인은 다양하겠지만, 제 경우에는 다음과 같은 상황에서도 발생했습니다.

Build FAILED.

       "c:/temp/vcpkg\toolsrc\dirs.proj" (default target) (1) ->
       "c:/temp/vcpkg\toolsrc\vcpkg\vcpkg.vcxproj" (Build target) (2:2) ->
       "c:/temp/vcpkg\toolsrc\vcpkglib\vcpkglib.vcxproj" (default target) (3:4) ->
       (ClCompile target) ->
         c:/temp/vcpkg\toolsrc\src\vcpkg\base\cofffilereader.cpp(248): error C4996: 'std::fpos<_Mbstatet>::seekpos
       ': warning STL4019: The member std::fpos::seekpos() is non-Standard, and is preserved only for compatibility wit
       h workarounds for old versions of Visual C++. It will be removed in a future release, and in this release always
        returns 0. Please use standards-conforming mechanisms to manipulate fpos, such as conversions to and from strea
       moff, or an integral type, instead. If you are receiving this message while compiling Boost.IOStreams, a fix has
        been submitted upstream to make Boost use standards-conforming mechanisms, as it does for other compilers. You
       can define _SILENCE_FPOS_SEEKPOS_DEPRECATION_WARNING to acknowledge that you have received this warning, or defi
       ne _REMOVE_FPOS_SEEKPOS to remove std::fpos::seekpos entirely. [c:/temp/vcpkg\toolsrc\vcpkglib\vcpkglib.vcxproj]

    0 Warning(s)
    1 Error(s)

Time Elapsed 00:00:08.10
c:/temp/vcpkg\scripts\bootstrap.ps1 : Building vcpkg.exe failed. Please ensure you have installed Visual Studio with the Desktop C++ workload and the Windows SDK for Desktop C++.
At line:1 char:4
+ & {& 'c:/temp/vcpkg\scripts\bootstrap.ps1'}
+    ~~~~~~~~~~~~~~~~~~~~~~~~~~~~~~~~~~~~~~~~~~~~
    + CategoryInfo          : NotSpecified: (:) [Write-Error], WriteErrorException
    + FullyQualifiedErrorId : Microsoft.PowerShell.Commands.WriteErrorException,bootstrap.ps1

즉, Visual Studio를 업그레이드하면서 Visual C++ 컴파일러가 보다 더 공격적으로 표준을 지키는 기본 동작을 하는 바람에 vcpkg 소스 코드가 빌드가 안 되는 것입니다.

이런 경우에 해법은 2가지가 있을 것입니다. 하나는 vcxproj 파일의 빌드 옵션에 /WX를 추가하는 것입니다.

/WX (Treat Linker Warnings as Errors)
; https://msdn.microsoft.com/en-us/library/ms235592.aspx

또는, 약간의 시간이 지나고 나면 vcpkg 개발팀도 이 문제를 인지하고 github 소스 코드를 업데이트할 것이므로 "git pull" 명령어로 최신 업데이트를 받아 보는 것입니다. 제 경우에는 후자의 조치로 해결을 했습니다. ^^




참고로, git pull 명령어가 다음과 같이 막힐 때가 있습니다.

c:/temp/vcpkg>git pull
error: Your local changes to the following files would be overwritten by merge:
        scripts/cmake/vcpkg_get_windows_sdk.cmake
        scripts/getWindowsSDK.ps1
Please commit your changes or stash them before you merge.
Aborting
Updating 76096c95..eccae2ad

메시지에 따라 다음과 같이 stash를 하든,

c:/temp/vcpkg>git stash
Saved working directory and index state WIP on master: 76096c95 Merge pull request #2381 from markgarcia/tbb-2018_U2

어차피 vcpkg의 소스 코드를 수정하지 않는다고 하면 clean을 해도 무방할 것입니다.




[이 글에 대해서 여러분들과 의견을 공유하고 싶습니다. 틀리거나 미흡한 부분 또는 의문 사항이 있으시면 언제든 댓글 남겨주십시오.]





[최초 등록일: ]
[최종 수정일: 12/19/2018 ]

Creative Commons License
이 저작물은 크리에이티브 커먼즈 코리아 저작자표시-비영리-변경금지 2.0 대한민국 라이센스에 따라 이용하실 수 있습니다.
by SeongTae Jeong, mailto:kevin13@chol.com

비밀번호

댓글 쓴 사람
 




[1]  2  3  4  5  6  7  8  9  10  11  12  13  14  15  ...
NoWriterDateCnt.TitleFile(s)
11817정성태2/17/201922오류 유형: 514. WinDbg Preview 실행 오류 - Error : DbgX.dll : WindowsDebugger.WindowsDebuggerException: Could not load dbgeng.dll
11816정성태2/17/201951Windows: 157. 윈도우 스토어 앱(Microsoft Store App)을 명령행에서 직접 실행하는 방법
11815정성태2/14/201939오류 유형: 513. Visual Studio 2019 - VSIX 설치 시 "The extension cannot be installed to this product due to prerequisites that cannot be resolved." 오류 발생
11814정성태2/12/201993오류 유형: 512. VM(가상 머신)의 NT 서비스들이 자동 시작되지 않는 문제
11813정성태2/12/2019119.NET Framework: 809. C# - ("Save File Dialog" 등의) 대화 창에 확장 속성을 보이는 방법
11812정성태2/11/201974오류 유형: 511. Windows Server 2003 VM 부팅 후 로그인 시점에 0xC0000005 BSOD 발생
11811정성태2/11/201984오류 유형: 510. 서버 운영체제에 NVIDIA GeForce Experience 실행 시 wlanapi.dll 누락 문제
11810정성태2/11/201977.NET Framework: 808. .NET Profiler - GAC 모듈에서 GAC 비-등록 모듈을 참조하는 경우의 문제
11809정성태2/11/201993.NET Framework: 807. ClrMD를 이용해 메모리 덤프 파일로부터 특정 인스턴스를 참조하고 있는 소유자 확인
11808정성태2/8/2019342디버깅 기술: 123. windbg - 닷넷 응용 프로그램의 메모리 누수 분석
11807정성태1/29/2019198Windows: 156. 가상 디스크의 용량을 복구 파티션으로 인해 늘리지 못하는 경우
11806정성태1/29/2019195디버깅 기술: 122. windbg - 덤프 파일로부터 PID와 환경 변수 등의 정보를 구하는 방법
11805정성태1/28/2019531.NET Framework: 806. C# - int []와 object []의 차이로 이해하는 제네릭의 필요성 [2]파일 다운로드1
11804정성태1/24/2019188Windows: 155. diskpart - remove letter 이후 재부팅 시 다시 드라이브 문자가 할당되는 경우
11803정성태1/10/2019405디버깅 기술: 121. windbg - 닷넷 Finalizer 스레드가 멈춰있는 현상
11802정성태1/7/2019514.NET Framework: 805. 두 개의 윈도우를 각각 실행하는 방법(Windows Forms, WPF)파일 다운로드1
11801정성태1/1/2019526개발 환경 구성: 427. Netsh의 네트워크 모니터링 기능 [1]
11800정성태12/28/2018347오류 유형: 509. WCF 호출 오류 메시지 - System.ServiceModel.CommunicationException: Internal Server Error
11799정성태12/19/2018619.NET Framework: 804. WPF(또는 WinForm)에서 UWP UI 구성 요소 사용하는 방법 [2]파일 다운로드1
11798정성태12/19/2018824개발 환경 구성: 426. vcpkg - "Building vcpkg.exe failed. Please ensure you have installed Visual Studio with the Desktop C++ workload and the Windows SDK for Desktop C++"
11797정성태12/19/2018363개발 환경 구성: 425. vcpkg - CMake Error: Problem with archive_write_header(): Can't create '' 빌드 오류
11796정성태12/19/2018384개발 환경 구성: 424. vcpkg - "File does not have expected hash" 오류를 무시하는 방법
11795정성태12/19/2018407Windows: 154. PowerShell - Zone 별로 DNS 레코드 유형 정보 조회
11794정성태12/17/2018396오류 유형: 508. Get-AzureWebsite : Request to a downlevel service failed.
11793정성태12/16/2018506개발 환경 구성: 423. NuGet 패키지 제작 - Native와 Managed DLL을 분리하는 방법
[1]  2  3  4  5  6  7  8  9  10  11  12  13  14  15  ...