Microsoft MVP성태의 닷넷 이야기
글쓴 사람
홈페이지
첨부 파일
 

msbuild 오류 - Could not find a part of the path '%LOCALAPPDATA%\Temp\2\.NETFramework,Version=v4.0.AssemblyAttributes.cs'

이상하군요. 잘 되던 빌드가 다음과 같이 오류가 발생합니다.

d:\temp\TestProject1\TestProject1> msbuild TestProject1.csproj /t:Rebuild
Microsoft (R) Build Engine version 15.9.21+g9802d43bc3 for .NET Framework
Copyright (C) Microsoft Corporation. All rights reserved.

Build started 2019-05-21 오후 7:07:23.
Project "d:\temp\TestProject1\TestProject1\TestProject1.csproj" on node 1 (Rebuild target(s)).
CoreClean:
  Deleting file "d:\temp\TestProject1\TestProject1\obj\Debug\TestProject1.csprojAssemblyReference.cache".
  Deleting file "d:\temp\TestProject1\TestProject1\obj\Debug\TestProject1.csproj.CoreCompileInputs.cache".
C:\Program Files (x86)\Microsoft Visual Studio\2017\Enterprise\MSBuild\15.0\bin\Microsoft.Common.CurrentVersion.targets(3325,5): warning MSB3491: Could not write lines to file "C:\Users\TestUser\AppData\Local\Temp\2\.NETFramework,Version=v4.0.AssemblyAttributes.cs". Could not find a part of the path 'C:\Users\TestUser\AppData\Local\Temp\2\.NETFramework,Version=v4.0.AssemblyAttributes.cs'. [d:\temp\TestProject1\TestProject1\TestProject1.csproj]
  The previous error was converted to a warning because the task was called with ContinueOnError=true.
  Build continuing because "ContinueOnError" on the task "WriteLinesToFile" is set to "true".
CoreCompile:
  C:\Program Files (x86)\Microsoft Visual Studio\2017\Enterprise\MSBuild\15.0\bin\Roslyn\csc.exe /noconfig /nowarn:1701,1702 /nostdlib+ /errorreport:prompt /warn:4 /define:DEBUG;TRACE /highentropyva- /reference:"C:\Program Files (x86)\Microsoft Visual Studio\2017\Enterprise\Common7\IDE\ReferenceAssemblies\v4.0\Microsoft.VisualStudio.QualityTools.LoadTestFramework.dll" /reference:"C:\Program Files (x86)\Microsoft Visual Studio\2017\Enterprise\Common7\IDE\ReferenceAssemblies\v4.0\Microsoft.VisualStudio.QualityTools.UnitTestFramework.dll" /reference:"C:\Program Files (x86)\Microsoft Visual Studio\2017\Enterprise\Common7\IDE\ReferenceAssemblies\v4.0\Microsoft.VisualStudio.QualityTools.WebTestFramework.dll" /reference:"C:\Program Files (x86)\Reference Assemblies\Microsoft\Framework\.NETFramewo
  rk\v4.0\mscorlib.dll" /reference:"C:\Program Files (x86)\Reference Assemblies\Microsoft\Framework\.NETFramework\v4.0\System.Core.dll" /reference:"C:\Program Files (x86)\Reference Assemblies\Microsoft\Framework\.NETFramework\v4.0\System.dll" /reference:"C:\Program Files (x86)\Reference Assemblies\Microsoft\Framework\.NETFramework\v4.0\System.Runtime.Serialization.dll" /reference:"C:\Program Files (x86)\Reference Assemblies\Microsoft\Framework\.NETFramework\v4.0\System.ServiceModel.dll" /reference:"C:\Program Files (x86)\Reference Assemblies\Microsoft\Framework\.NETFramework\v4.0\System.Xml.dll" /debug+ /debug:full /filealign:512 /optimize- /out:obj\Debug\TestProject1.dll /ruleset:"C:\Program Files (x86)\Microsoft Visual Studio\2017\Enterprise\Team Tools\Static Analysis Tools\\Rule Sets\M
  inimumRecommendedRules.ruleset" /target:library /utf8output AdditionalTest.cs "Service References\JenniferTest\Reference.cs" "C:\Users\TestUser\AppData\Local\Temp\2\.NETFramework,Version=v4.0.AssemblyAttributes.cs"
  Using shared compilation with compiler from directory: C:\Program Files (x86)\Microsoft Visual Studio\2017\Enterprise\MSBuild\15.0\bin\Roslyn
CSC : error CS2001: Source file 'C:\Users\TestUser\AppData\Local\Temp\2\.NETFramework,Version=v4.0.AssemblyAttributes.cs' could not be found. [d:\temp\TestProject1\TestProject1\TestProject1.csproj]
Done Building Project "d:\temp\TestProject1\TestProject1\TestProject1.csproj" (Rebuild target(s)) -- FAILED.


Build FAILED.

"d:\temp\TestProject1\TestProject1\TestProject1.csproj" (Rebuild target) (1) ->
(GenerateTargetFrameworkMonikerAttribute target) ->
  C:\Program Files (x86)\Microsoft Visual Studio\2017\Enterprise\MSBuild\15.0\bin\Microsoft.Common.CurrentVersion.targets(3325,5): warning MSB3491: Could not write lines to file "C:\Users\TestUser\AppData\Local\Temp\2\.NETFramework,Version=v4.0.AssemblyAttributes.cs". Could not find a part of the path 'C:\Users\TestUser\AppData\Local\Temp\2\.NETFramework,Version=v4.0.AssemblyAttributes.cs'. [d:\temp\TestProject1\TestProject1\TestProject1.csproj]


"d:\temp\TestProject1\TestProject1\TestProject1.csproj" (Rebuild target) (1) ->
(CoreCompile target) ->
  CSC : error CS2001: Source file 'C:\Users\TestUser\AppData\Local\Temp\2\.NETFramework,Version=v4.0.AssemblyAttributes.cs' could not be found. [d:\temp\TestProject1\TestProject1\TestProject1.csproj]

    1 Warning(s)
    1 Error(s)

Time Elapsed 00:00:01.04

그런데, 해당 명령어를 "관리자 권한"으로 실행하면 정상적으로 빌드가 됩니다. 이때 차이가 나는 점이 있다면 문제가 되는 ".NETFramework,Version=v4.0.AssemblyAttributes.cs" 파일의 경로입니다.

[일반 사용자 권한으로 빌드 오류]
C:\Users\TestUser\AppData\Local\Temp\2\

[관리자 권한으로 정상 빌드]
C:\Users\TestUser\AppData\Local\Temp\

\Temp\ 밑에 붙은 "2"는 RDP 접속 시의 세션 ID에 해당합니다.

그리고 실제로 "%LOCALAPPDATA%\Temp\" 폴더에 가보면 하위에 "2"라는 이름의 폴더가 없습니다. 따라서 이런 경우 "2" 폴더를 생성하면 정상적으로 빌드가 되는 것을 확인할 수 있습니다.




[이 글에 대해서 여러분들과 의견을 공유하고 싶습니다. 틀리거나 미흡한 부분 또는 의문 사항이 있으시면 언제든 댓글 남겨주십시오.]

[연관 글]





[최초 등록일: ]
[최종 수정일: 5/21/2019 ]

Creative Commons License
이 저작물은 크리에이티브 커먼즈 코리아 저작자표시-비영리-변경금지 2.0 대한민국 라이센스에 따라 이용하실 수 있습니다.
by SeongTae Jeong, mailto:techsharer@outlook.com

비밀번호

댓글 쓴 사람
 




1  2  3  4  5  6  7  8  9  10  [11]  12  13  14  15  ...
NoWriterDateCnt.TitleFile(s)
11954정성태6/20/20191250오류 유형: 550. scp - sudo: no tty present and no askpass program specified
11953정성태6/20/2019751오류 유형: 549. The library 'libhostpolicy.so' required to execute the application was not found in '...'
11952정성태6/20/2019974Linux: 16. 우분투, Centos의 Netbios 호스트 이름 풀이 방법
11951정성태6/20/20191028오류 유형: 548. scp 연결 시 "Permission denied" 오류 및 "WARNING: REMOTE HOST IDENTIFICATION HAS CHANGED!" 경고
11950정성태6/18/20191259.NET Framework: 845. C# - 윈도우 작업 관리자와 리소스 모니터의 메모리 값을 구하는 방법
11949정성태6/18/2019671오류 유형: 547. CoreCLR Profiler 예제 프로젝트 빌드 시 컴파일 오류 유형
11948정성태6/17/2019810Linux: 15. 리눅스 환경의 Visual Studio Code에서 TFS 서버 연동
11947정성태9/25/20191015Linux: 14. 리눅스 환경에서 TFS 서버 연동
11946정성태6/17/20191248개발 환경 구성: 445. C# - MathNet으로 정규 분포를 따르는 데이터를 생성, PLplot으로 Histogram 표현파일 다운로드1
11945정성태6/25/20191070Linux: 13. node.js에서 syslog로 출력하는 방법
11944정성태6/16/20193141Linux: 12. Ubuntu 16.04/18.04에서 node.js 최신 버전 설치 방법
11943정성태6/15/20191268.NET Framework: 844. C# - 박싱과 언박싱 [1]
11942정성태6/20/20193312개발 환경 구성: 444. 로컬의 Visual Studio Code로 원격 리눅스 머신에 접속해 개발하는 방법
11941정성태6/13/2019836오류 유형: 546. "message NETSDK1057: You are using a preview version of .NET Core" 빌드 경고 없애는 방법
11940정성태6/13/2019720개발 환경 구성: 443. Visual Studio의 Connection Manager 기능(Remote SSH 관리)을 위한 명령행 도구파일 다운로드1
11939정성태6/13/2019751오류 유형: 545. Managed Debugging Assistant 'FatalExecutionEngineError'
11938정성태6/12/2019991Math: 59. C# - 웨이트 벡터 갱신식을 이용한 퍼셉트론 분류파일 다운로드1
11937정성태6/11/20192825개발 환경 구성: 442. .NET Core 3.0 preview 5를 이용해 Windows Forms/WPF 응용 프로그램 개발 [1]
11936정성태6/10/2019934Math: 58. C# - 최소 자승법의 1차, 2차 수렴 그래프 변화 확인파일 다운로드1
11935정성태6/9/20191117.NET Framework: 843. C# - PLplot 출력을 파일이 아닌 Window 화면으로 변경
11934정성태6/7/20191288VC++: 133. typedef struct와 타입 전방 선언으로 인한 C2371 오류파일 다운로드1
11933정성태6/7/20191243VC++: 132. enum 정의를 C++11의 enum class로 바꿀 때 유의할 사항파일 다운로드1
11932정성태6/7/2019993오류 유형: 544. C++ - fatal error C1017: invalid integer constant expression파일 다운로드1
11931정성태6/6/20191134개발 환경 구성: 441. C# - CairoSharp/GtkSharp 사용을 위한 프로젝트 구성 방법
11930정성태6/26/20191405.NET Framework: 842. .NET Reflection을 대체할 System.Reflection.Metadata 소개
11929정성태6/5/2019965.NET Framework: 841. Windows Forms/C# - 클립보드에 RTF 텍스트를 복사 및 확인하는 방법
1  2  3  4  5  6  7  8  9  10  [11]  12  13  14  15  ...