Microsoft MVP성태의 닷넷 이야기
글쓴 사람
홈페이지
첨부 파일
 

msbuild 오류 - Could not find a part of the path '%LOCALAPPDATA%\Temp\2\.NETFramework,Version=v4.0.AssemblyAttributes.cs'

이상하군요. 잘 되던 빌드가 다음과 같이 오류가 발생합니다.

d:\temp\TestProject1\TestProject1> msbuild TestProject1.csproj /t:Rebuild
Microsoft (R) Build Engine version 15.9.21+g9802d43bc3 for .NET Framework
Copyright (C) Microsoft Corporation. All rights reserved.

Build started 2019-05-21 오후 7:07:23.
Project "d:\temp\TestProject1\TestProject1\TestProject1.csproj" on node 1 (Rebuild target(s)).
CoreClean:
  Deleting file "d:\temp\TestProject1\TestProject1\obj\Debug\TestProject1.csprojAssemblyReference.cache".
  Deleting file "d:\temp\TestProject1\TestProject1\obj\Debug\TestProject1.csproj.CoreCompileInputs.cache".
C:\Program Files (x86)\Microsoft Visual Studio\2017\Enterprise\MSBuild\15.0\bin\Microsoft.Common.CurrentVersion.targets(3325,5): warning MSB3491: Could not write lines to file "C:\Users\TestUser\AppData\Local\Temp\2\.NETFramework,Version=v4.0.AssemblyAttributes.cs". Could not find a part of the path 'C:\Users\TestUser\AppData\Local\Temp\2\.NETFramework,Version=v4.0.AssemblyAttributes.cs'. [d:\temp\TestProject1\TestProject1\TestProject1.csproj]
  The previous error was converted to a warning because the task was called with ContinueOnError=true.
  Build continuing because "ContinueOnError" on the task "WriteLinesToFile" is set to "true".
CoreCompile:
  C:\Program Files (x86)\Microsoft Visual Studio\2017\Enterprise\MSBuild\15.0\bin\Roslyn\csc.exe /noconfig /nowarn:1701,1702 /nostdlib+ /errorreport:prompt /warn:4 /define:DEBUG;TRACE /highentropyva- /reference:"C:\Program Files (x86)\Microsoft Visual Studio\2017\Enterprise\Common7\IDE\ReferenceAssemblies\v4.0\Microsoft.VisualStudio.QualityTools.LoadTestFramework.dll" /reference:"C:\Program Files (x86)\Microsoft Visual Studio\2017\Enterprise\Common7\IDE\ReferenceAssemblies\v4.0\Microsoft.VisualStudio.QualityTools.UnitTestFramework.dll" /reference:"C:\Program Files (x86)\Microsoft Visual Studio\2017\Enterprise\Common7\IDE\ReferenceAssemblies\v4.0\Microsoft.VisualStudio.QualityTools.WebTestFramework.dll" /reference:"C:\Program Files (x86)\Reference Assemblies\Microsoft\Framework\.NETFramewo
  rk\v4.0\mscorlib.dll" /reference:"C:\Program Files (x86)\Reference Assemblies\Microsoft\Framework\.NETFramework\v4.0\System.Core.dll" /reference:"C:\Program Files (x86)\Reference Assemblies\Microsoft\Framework\.NETFramework\v4.0\System.dll" /reference:"C:\Program Files (x86)\Reference Assemblies\Microsoft\Framework\.NETFramework\v4.0\System.Runtime.Serialization.dll" /reference:"C:\Program Files (x86)\Reference Assemblies\Microsoft\Framework\.NETFramework\v4.0\System.ServiceModel.dll" /reference:"C:\Program Files (x86)\Reference Assemblies\Microsoft\Framework\.NETFramework\v4.0\System.Xml.dll" /debug+ /debug:full /filealign:512 /optimize- /out:obj\Debug\TestProject1.dll /ruleset:"C:\Program Files (x86)\Microsoft Visual Studio\2017\Enterprise\Team Tools\Static Analysis Tools\\Rule Sets\M
  inimumRecommendedRules.ruleset" /target:library /utf8output AdditionalTest.cs "Service References\JenniferTest\Reference.cs" "C:\Users\TestUser\AppData\Local\Temp\2\.NETFramework,Version=v4.0.AssemblyAttributes.cs"
  Using shared compilation with compiler from directory: C:\Program Files (x86)\Microsoft Visual Studio\2017\Enterprise\MSBuild\15.0\bin\Roslyn
CSC : error CS2001: Source file 'C:\Users\TestUser\AppData\Local\Temp\2\.NETFramework,Version=v4.0.AssemblyAttributes.cs' could not be found. [d:\temp\TestProject1\TestProject1\TestProject1.csproj]
Done Building Project "d:\temp\TestProject1\TestProject1\TestProject1.csproj" (Rebuild target(s)) -- FAILED.


Build FAILED.

"d:\temp\TestProject1\TestProject1\TestProject1.csproj" (Rebuild target) (1) ->
(GenerateTargetFrameworkMonikerAttribute target) ->
  C:\Program Files (x86)\Microsoft Visual Studio\2017\Enterprise\MSBuild\15.0\bin\Microsoft.Common.CurrentVersion.targets(3325,5): warning MSB3491: Could not write lines to file "C:\Users\TestUser\AppData\Local\Temp\2\.NETFramework,Version=v4.0.AssemblyAttributes.cs". Could not find a part of the path 'C:\Users\TestUser\AppData\Local\Temp\2\.NETFramework,Version=v4.0.AssemblyAttributes.cs'. [d:\temp\TestProject1\TestProject1\TestProject1.csproj]


"d:\temp\TestProject1\TestProject1\TestProject1.csproj" (Rebuild target) (1) ->
(CoreCompile target) ->
  CSC : error CS2001: Source file 'C:\Users\TestUser\AppData\Local\Temp\2\.NETFramework,Version=v4.0.AssemblyAttributes.cs' could not be found. [d:\temp\TestProject1\TestProject1\TestProject1.csproj]

    1 Warning(s)
    1 Error(s)

Time Elapsed 00:00:01.04

그런데, 해당 명령어를 "관리자 권한"으로 실행하면 정상적으로 빌드가 됩니다. 이때 차이가 나는 점이 있다면 문제가 되는 ".NETFramework,Version=v4.0.AssemblyAttributes.cs" 파일의 경로입니다.

[일반 사용자 권한으로 빌드 오류]
C:\Users\TestUser\AppData\Local\Temp\2\

[관리자 권한으로 정상 빌드]
C:\Users\TestUser\AppData\Local\Temp\

\Temp\ 밑에 붙은 "2"는 RDP 접속 시의 세션 ID에 해당합니다.

그리고 실제로 "%LOCALAPPDATA%\Temp\" 폴더에 가보면 하위에 "2"라는 이름의 폴더가 없습니다. 따라서 이런 경우 "2" 폴더를 생성하면 정상적으로 빌드가 되는 것을 확인할 수 있습니다.




[이 글에 대해서 여러분들과 의견을 공유하고 싶습니다. 틀리거나 미흡한 부분 또는 의문 사항이 있으시면 언제든 댓글 남겨주십시오.]

[연관 글]





[최초 등록일: ]
[최종 수정일: 5/21/2019 ]

Creative Commons License
이 저작물은 크리에이티브 커먼즈 코리아 저작자표시-비영리-변경금지 2.0 대한민국 라이센스에 따라 이용하실 수 있습니다.
by SeongTae Jeong, mailto:techsharer@outlook.com

비밀번호

댓글 쓴 사람
 




1  2  3  4  5  6  7  8  9  10  11  12  [13]  14  15  ...
NoWriterDateCnt.TitleFile(s)
11918정성태5/27/20191629Math: 53. C# - 행렬식을 이용한 최소 자승법(LSM: Least Square Method)파일 다운로드1
11917정성태5/24/20191551Math: 52. MathNet을 이용한 간단한 통계 정보 처리 - 분산/표준편차파일 다운로드1
11916정성태5/24/20191097Math: 51. MathNET + OxyPlot을 이용한 간단한 통계 정보 처리 - Histogram파일 다운로드1
11915정성태5/24/20191235Linux: 11. 리눅스의 환경 변수 관련 함수 정리 - putenv, setenv, unsetenv
11914정성태5/24/20191785Linux: 10. 윈도우의 GetTickCount와 리눅스의 clock_gettime파일 다운로드1
11913정성태5/24/20191128.NET Framework: 838. C# - 숫자형 타입의 bit(2진) 문자열, 16진수 문자열 구하는 방법파일 다운로드1
11912정성태5/23/20191134VS.NET IDE: 137. Visual Studio 2019 버전 16.1부터 리눅스 C/C++ 프로젝트에 추가된 WSL 지원
11911정성태5/23/20191218VS.NET IDE: 136. Visual Studio 2019 - 리눅스 C/C++ 프로젝트에 인텔리센스가 동작하지 않는 경우
11910정성태5/24/20192352Math: 50. C# - MathNet.Numerics의 Matrix(행렬) 연산파일 다운로드1
11909정성태5/25/20191654.NET Framework: 837. C# - PLplot 사용 예제 [1]파일 다운로드1
11908정성태5/22/20191087.NET Framework: 836. C# - Python range 함수 구현파일 다운로드1
11907정성태6/4/2019900오류 유형: 541. msbuild - MSB4024 The imported project file "...targets" could not be loaded
11906정성태5/21/2019787.NET Framework: 835. .NET Core/C# - 리눅스 syslog에 로그 남기는 방법
11905정성태5/21/20191063.NET Framework: 834. C# - 폴더 경로 문자열에서 "..", "." 표기를 고려한 최종 문자열을 얻는 방법 - 두 번째 이야기
11904정성태5/21/20192109.NET Framework: 833. C# - Open Hardware Monitor를 이용한 CPU 온도 정보파일 다운로드1
11903정성태5/21/20191238오류 유형: 540. .NET Core - System.PlatformNotSupportedException: The named version of this synchronization primitive is not supported on this platform.
11902정성태5/21/2019819오류 유형: 539. mstest 실행 시 "The directory name is invalid." 오류 발생
11901정성태5/21/20191372오류 유형: 538. msbuild 오류 - Could not find a part of the path '%LOCALAPPDATA%\Temp\2\.NETFramework,Version=v4.0.AssemblyAttributes.cs'
11900정성태3/12/20201291오류 유형: 537. "sfc /scannow" 실행 중 시스템이 부팅되는 현상
11899정성태5/17/20191425Linux: 9. Linux에서 윈도우의 OutputDebugString 대신 사용할 수 있는 syslog [1]
11898정성태5/20/20191439VC++: 130. C++ string의 c_str과 data 함수의 차이점 [3]
11897정성태5/16/20192550오류 유형: 536. Visual Studio - "Developer Pack"을 설치했는데도 "대상 프레임워크" 목록에 나오지 않는 경우 [1]
11896정성태5/15/20191986개발 환경 구성: 440. C#, C++ - double의 Infinity, NaN 표현 방식파일 다운로드1
11895정성태5/12/20191441.NET Framework: 832. ML.NET Model Builder - 회귀(Regression), 다중 분류(Multi-class classification) 예제파일 다운로드1
11894정성태5/12/20191918VS.NET IDE: 135. Visual Studio - ML.NET Model Builder 소개 [1]
11893정성태5/10/20191461오류 유형: 535. C# 6.0 이상의 문법을 컴파일 시 오류가 발생한다면?
1  2  3  4  5  6  7  8  9  10  11  12  [13]  14  15  ...