Microsoft MVP성태의 닷넷 이야기
글쓴 사람
정성태 (techsharer at outlook.com)
홈페이지
첨부 파일
 

.NET Core 2.2 빌드 - error MSB4018: The "RazorTagHelper" task failed unexpectedly.

이상하군요, .NET Core 2.0/2.1 프로젝트는 괜찮은데 유독 2.2 프로젝트에서만 빌드 오류가 발생합니다.

Rebuild started...
1>------ Rebuild All started: Project: CoreCoreWin2, Configuration: Debug Any CPU ------
1>C:\Program Files\dotnet\sdk\5.0.100\Sdks\Microsoft.NET.Sdk\targets\Microsoft.NET.EolTargetFrameworks.targets(28,5): warning NETSDK1138: The target framework 'netcoreapp2.2' is out of support and will not receive security updates in the future. Please refer to https://aka.ms/dotnet-core-support for more information about the support policy.
1>D:\workshop2\JenniferV\gitlab\UnitTest\AzureWebApps\AzureWebTest\CoreCoreWin2\Pages\Index.cshtml.cs(142,36,142,49): warning CS1998: This async method lacks 'await' operators and will run synchronously. Consider using the 'await' operator to await non-blocking API calls, or 'await Task.Run(...)' to do CPU-bound work on a background thread.
1>F:\nuget_root\microsoft.aspnetcore.razor.design\2.2.0\build\netstandard2.0\Microsoft.AspNetCore.Razor.Design.CodeGeneration.targets(79,5): error MSB4018: The "RazorTagHelper" task failed unexpectedly.
1>F:\nuget_root\microsoft.aspnetcore.razor.design\2.2.0\build\netstandard2.0\Microsoft.AspNetCore.Razor.Design.CodeGeneration.targets(79,5): error MSB4018: System.InvalidOperationException: DOTNET_HOST_PATH is not set
1>F:\nuget_root\microsoft.aspnetcore.razor.design\2.2.0\build\netstandard2.0\Microsoft.AspNetCore.Razor.Design.CodeGeneration.targets(79,5): error MSB4018:    at Microsoft.AspNetCore.Razor.Tasks.DotNetToolTask.get_DotNetPath()
1>F:\nuget_root\microsoft.aspnetcore.razor.design\2.2.0\build\netstandard2.0\Microsoft.AspNetCore.Razor.Design.CodeGeneration.targets(79,5): error MSB4018:    at Microsoft.AspNetCore.Razor.Tasks.DotNetToolTask.GenerateFullPathToTool()
1>F:\nuget_root\microsoft.aspnetcore.razor.design\2.2.0\build\netstandard2.0\Microsoft.AspNetCore.Razor.Design.CodeGeneration.targets(79,5): error MSB4018:    at Microsoft.Build.Utilities.ToolTask.ComputePathToTool()
1>F:\nuget_root\microsoft.aspnetcore.razor.design\2.2.0\build\netstandard2.0\Microsoft.AspNetCore.Razor.Design.CodeGeneration.targets(79,5): error MSB4018:    at Microsoft.Build.Utilities.ToolTask.Execute()
1>F:\nuget_root\microsoft.aspnetcore.razor.design\2.2.0\build\netstandard2.0\Microsoft.AspNetCore.Razor.Design.CodeGeneration.targets(79,5): error MSB4018:    at Microsoft.AspNetCore.Razor.Tasks.DotNetToolTask.Execute()
1>F:\nuget_root\microsoft.aspnetcore.razor.design\2.2.0\build\netstandard2.0\Microsoft.AspNetCore.Razor.Design.CodeGeneration.targets(79,5): error MSB4018:    at Microsoft.Build.BackEnd.TaskExecutionHost.Microsoft.Build.BackEnd.ITaskExecutionHost.Execute()
1>F:\nuget_root\microsoft.aspnetcore.razor.design\2.2.0\build\netstandard2.0\Microsoft.AspNetCore.Razor.Design.CodeGeneration.targets(79,5): error MSB4018:    at Microsoft.Build.BackEnd.TaskBuilder.<ExecuteInstantiatedTask>d__26.MoveNext()
1>Done building project "CoreCoreWin2.csproj" -- FAILED.
========== Rebuild All: 0 succeeded, 1 failed, 0 skipped ==========

DOTNET_HOST_PATH가 설정되어 있지 않다고 하는데, 실제로 검색해 보면,

Build is failing for Microsoft.NET.Sdk.Razor project
; https://developercommunity2.visualstudio.com/t/Build-is-failing-for-MicrosoftNETSdkR/1251808?preview=true

해결책으로 환경 변수 설정이 필요하다고 합니다.

환경 변수 이름: DOTNET_HOST_PATH
환경 변숫값: dotnet

path라는 이름에서 dotnet.exe가 있는 경로를 지정해야 할 것 같지만,

%ProgramFiles%\dotnet\dotnet.exe

환경 변수 PATH에 경로가 잡혀 있는 경우 dotnet만 있어도 잘 동작합니다.




[이 글에 대해서 여러분들과 의견을 공유하고 싶습니다. 틀리거나 미흡한 부분 또는 의문 사항이 있으시면 언제든 댓글 남겨주십시오.]



donaricano-btn



[최초 등록일: ]
[최종 수정일: 12/1/2020

Creative Commons License
이 저작물은 크리에이티브 커먼즈 코리아 저작자표시-비영리-변경금지 2.0 대한민국 라이센스에 따라 이용하실 수 있습니다.
by SeongTae Jeong, mailto:techsharer at outlook.com

비밀번호

댓글 쓴 사람
 




1  2  3  4  5  6  7  8  9  10  11  12  [13]  14  15  ...
NoWriterDateCnt.TitleFile(s)
12540정성태2/17/2021851.NET Framework: 1024. C# - Win32 API에 대한 P/Invoke를 대신하는 Microsoft.Windows.CsWin32 패키지
12539정성태2/16/2021925Windows: 189. WM_TIMER의 동작 방식 개요파일 다운로드1
12538정성태2/15/20211061.NET Framework: 1023. C# - GC 힙이 아닌 Native 힙에 인스턴스 생성 - 0SuperComicLib.LowLevel 라이브러리 소개 [2]
12537정성태2/11/20211168.NET Framework: 1022. UI 요소의 접근은 반드시 그 UI를 만든 스레드에서! - 두 번째 이야기
12536정성태2/9/20211045개발 환경 구성: 542. BDP(Bandwidth-delay product)와 TCP Receive Window
12535정성태2/9/2021735개발 환경 구성: 541. Wireshark로 확인하는 LSO(Large Send Offload), RSC(Receive Segment Coalescing) 옵션
12534정성태2/8/20211004개발 환경 구성: 540. Wireshark + C/C++로 확인하는 TCP 연결에서의 closesocket 동작 [1]파일 다운로드1
12533정성태2/8/2021964개발 환경 구성: 539. Wireshark + C/C++로 확인하는 TCP 연결에서의 shutdown 동작파일 다운로드1
12532정성태2/6/2021874개발 환경 구성: 538. Wireshark + C#으로 확인하는 ReceiveBufferSize(SO_RCVBUF), SendBufferSize(SO_SNDBUF) [1]
12531정성태2/5/2021733개발 환경 구성: 537. Wireshark + C#으로 확인하는 PSH flag와 Nagle 알고리듬파일 다운로드1
12530정성태2/4/20211171개발 환경 구성: 536. Wireshark + C#으로 확인하는 TCP 통신의 Receive Window
12529정성태2/4/2021825개발 환경 구성: 535. Wireshark + C#으로 확인하는 TCP 통신의 MIN RTO [1]
12528정성태2/1/2021877개발 환경 구성: 534. Wireshark + C#으로 확인하는 TCP 통신의 MSS(Maximum Segment Size) - 윈도우 환경
12527정성태2/1/2021901개발 환경 구성: 533. Wireshark + C#으로 확인하는 TCP 통신의 MSS(Maximum Segment Size) - 리눅스 환경파일 다운로드1
12526정성태2/1/2021718개발 환경 구성: 532. Azure Devops의 파이프라인 빌드 시 snk 파일 다루는 방법 - Secure file
12525정성태2/1/2021609개발 환경 구성: 531. Azure Devops - 파이프라인 실행 시 빌드 이벤트를 생략하는 방법
12524정성태1/31/2021754개발 환경 구성: 530. 기존 github 프로젝트를 Azure Devops의 빌드 Pipeline에 연결하는 방법 [1]
12523정성태1/31/2021750개발 환경 구성: 529. 기존 github 프로젝트를 Azure Devops의 Board에 연결하는 방법
12522정성태1/31/2021906개발 환경 구성: 528. 오라클 클라우드의 리눅스 VM - 9000 MTU Jumbo Frame 테스트
12521정성태1/31/20211037개발 환경 구성: 527. 이더넷(Ethernet) 환경의 TCP 통신에서 MSS(Maximum Segment Size) 확인
12520정성태1/30/2021635개발 환경 구성: 526. 오라클 클라우드의 VM에 ping ICMP 여는 방법
12519정성태1/30/2021761개발 환경 구성: 525. 오라클 클라우드의 VM을 외부에서 접근하기 위해 포트 여는 방법
12518정성태1/30/20211686Linux: 37. Ubuntu에 Wireshark 설치
12517정성태1/30/20211330Linux: 36. 윈도우 클라이언트에서 X2Go를 이용한 원격 리눅스의 GUI 접속 - 우분투 20.04
12516정성태1/29/2021834Windows: 188. Windows - TCP default template 설정 방법
12515정성태1/28/2021936웹: 41. Microsoft Edge - localhost에 대해 http 접근 시 무조건 https로 바뀌는 문제 [3]
1  2  3  4  5  6  7  8  9  10  11  12  [13]  14  15  ...