Microsoft MVP성태의 닷넷 이야기
글쓴 사람
홈페이지
첨부 파일
 

vcpkg - "Building vcpkg.exe failed. Please ensure you have installed Visual Studio with the Desktop C++ workload and the Windows SDK for Desktop C++"

이 오류의 원인은 다양하겠지만, 제 경우에는 다음과 같은 상황에서도 발생했습니다.

Build FAILED.

       "c:/temp/vcpkg\toolsrc\dirs.proj" (default target) (1) ->
       "c:/temp/vcpkg\toolsrc\vcpkg\vcpkg.vcxproj" (Build target) (2:2) ->
       "c:/temp/vcpkg\toolsrc\vcpkglib\vcpkglib.vcxproj" (default target) (3:4) ->
       (ClCompile target) ->
         c:/temp/vcpkg\toolsrc\src\vcpkg\base\cofffilereader.cpp(248): error C4996: 'std::fpos<_Mbstatet>::seekpos
       ': warning STL4019: The member std::fpos::seekpos() is non-Standard, and is preserved only for compatibility wit
       h workarounds for old versions of Visual C++. It will be removed in a future release, and in this release always
        returns 0. Please use standards-conforming mechanisms to manipulate fpos, such as conversions to and from strea
       moff, or an integral type, instead. If you are receiving this message while compiling Boost.IOStreams, a fix has
        been submitted upstream to make Boost use standards-conforming mechanisms, as it does for other compilers. You
       can define _SILENCE_FPOS_SEEKPOS_DEPRECATION_WARNING to acknowledge that you have received this warning, or defi
       ne _REMOVE_FPOS_SEEKPOS to remove std::fpos::seekpos entirely. [c:/temp/vcpkg\toolsrc\vcpkglib\vcpkglib.vcxproj]

    0 Warning(s)
    1 Error(s)

Time Elapsed 00:00:08.10
c:/temp/vcpkg\scripts\bootstrap.ps1 : Building vcpkg.exe failed. Please ensure you have installed Visual Studio with the Desktop C++ workload and the Windows SDK for Desktop C++.
At line:1 char:4
+ & {& 'c:/temp/vcpkg\scripts\bootstrap.ps1'}
+    ~~~~~~~~~~~~~~~~~~~~~~~~~~~~~~~~~~~~~~~~~~~~
    + CategoryInfo          : NotSpecified: (:) [Write-Error], WriteErrorException
    + FullyQualifiedErrorId : Microsoft.PowerShell.Commands.WriteErrorException,bootstrap.ps1

즉, Visual Studio를 업그레이드하면서 Visual C++ 컴파일러가 보다 더 공격적으로 표준을 지키는 기본 동작을 하는 바람에 vcpkg 소스 코드가 빌드가 안 되는 것입니다.

이런 경우에 해법은 2가지가 있을 것입니다. 하나는 vcxproj 파일의 빌드 옵션에 /WX를 추가하는 것입니다.

/WX (Treat Linker Warnings as Errors)
; https://msdn.microsoft.com/en-us/library/ms235592.aspx

또는, 약간의 시간이 지나고 나면 vcpkg 개발팀도 이 문제를 인지하고 github 소스 코드를 업데이트할 것이므로 "git pull" 명령어로 최신 업데이트를 받아 보는 것입니다. 제 경우에는 후자의 조치로 해결을 했습니다. ^^




참고로, git pull 명령어가 다음과 같이 막힐 때가 있습니다.

c:/temp/vcpkg>git pull
error: Your local changes to the following files would be overwritten by merge:
        scripts/cmake/vcpkg_get_windows_sdk.cmake
        scripts/getWindowsSDK.ps1
Please commit your changes or stash them before you merge.
Aborting
Updating 76096c95..eccae2ad

메시지에 따라 다음과 같이 stash를 하든,

c:/temp/vcpkg>git stash
Saved working directory and index state WIP on master: 76096c95 Merge pull request #2381 from markgarcia/tbb-2018_U2

어차피 vcpkg의 소스 코드를 수정하지 않는다고 하면 clean을 해도 무방할 것입니다.




[이 글에 대해서 여러분들과 의견을 공유하고 싶습니다. 틀리거나 미흡한 부분 또는 의문 사항이 있으시면 언제든 댓글 남겨주십시오.]





[최초 등록일: ]
[최종 수정일: 12/19/2018 ]

Creative Commons License
이 저작물은 크리에이티브 커먼즈 코리아 저작자표시-비영리-변경금지 2.0 대한민국 라이센스에 따라 이용하실 수 있습니다.
by SeongTae Jeong, mailto:techsharer@outlook.com

비밀번호

댓글 쓴 사람
 




1  2  3  4  5  6  7  8  9  10  11  12  [13]  14  15  ...
NoWriterDateCnt.TitleFile(s)
11908정성태5/22/2019948.NET Framework: 836. C# - Python range 함수 구현파일 다운로드1
11907정성태6/4/2019770오류 유형: 541. msbuild - MSB4024 The imported project file "...targets" could not be loaded
11906정성태5/21/2019689.NET Framework: 835. .NET Core/C# - 리눅스 syslog에 로그 남기는 방법
11905정성태5/21/2019887.NET Framework: 834. C# - 폴더 경로 문자열에서 "..", "." 표기를 고려한 최종 문자열을 얻는 방법 - 두 번째 이야기
11904정성태5/21/20191770.NET Framework: 833. C# - Open Hardware Monitor를 이용한 CPU 온도 정보파일 다운로드1
11903정성태5/21/20191059오류 유형: 540. .NET Core - System.PlatformNotSupportedException: The named version of this synchronization primitive is not supported on this platform.
11902정성태5/21/2019694오류 유형: 539. mstest 실행 시 "The directory name is invalid." 오류 발생
11901정성태5/21/20191193오류 유형: 538. msbuild 오류 - Could not find a part of the path '%LOCALAPPDATA%\Temp\2\.NETFramework,Version=v4.0.AssemblyAttributes.cs'
11900정성태3/12/20201074오류 유형: 537. "sfc /scannow" 실행 중 시스템이 부팅되는 현상
11899정성태5/17/20191260Linux: 9. Linux에서 윈도우의 OutputDebugString 대신 사용할 수 있는 syslog [1]
11898정성태5/20/20191266VC++: 130. C++ string의 c_str과 data 함수의 차이점 [3]
11897정성태5/16/20192182오류 유형: 536. Visual Studio - "Developer Pack"을 설치했는데도 "대상 프레임워크" 목록에 나오지 않는 경우 [1]
11896정성태5/15/20191608개발 환경 구성: 440. C#, C++ - double의 Infinity, NaN 표현 방식파일 다운로드1
11895정성태5/12/20191271.NET Framework: 832. ML.NET Model Builder - 회귀(Regression), 다중 분류(Multi-class classification) 예제파일 다운로드1
11894정성태5/12/20191724VS.NET IDE: 135. Visual Studio - ML.NET Model Builder 소개 [1]
11893정성태5/10/20191252오류 유형: 535. C# 6.0 이상의 문법을 컴파일 시 오류가 발생한다면?
11892정성태5/10/2019908웹: 38. HTTP Cookie의 expires 시간 형식(RFC7231)
11891정성태5/9/20191117.NET Framework: 831. (번역글) .NET Internals Cookbook Part 12 - Memory structure, attributes, handles
11890정성태5/8/2019900개발 환경 구성: 439. "Visual Studio Enterprise is required to execute the test." 메시지와 관련된 코드 기록
11889정성태5/8/2019986개발 환경 구성: 438. mstest, QTAgent의 로그 파일 설정 방법
11888정성태5/8/20191632.NET Framework: 830. C# - 비동기 호출을 취소하는 CancellationToken의 간단한 예제 코드파일 다운로드1
11887정성태5/8/20191272.NET Framework: 829. C# - yield 문을 사용할 수 있는 메서드의 조건
11886정성태5/8/20191270오류 유형: 534. mstest.exe 실행 시 "Visual Studio Enterprise is required to execute the test." 오류 [2]
11885정성태5/7/2019775오류 유형: 533. mstest.exe 실행 시 "File extension specified '.loadtest' is not a valid test extension." 오류 발생
11884정성태5/5/20191465.NET Framework: 828. C# DLL에서 Win32 C/C++처럼 dllexport 함수를 제공하는 방법 - 두 번째 이야기
11883정성태5/3/20191706.NET Framework: 827. C# - 인터넷 시간 서버로부터 받은 시간을 윈도우에 적용하는 방법파일 다운로드1
1  2  3  4  5  6  7  8  9  10  11  12  [13]  14  15  ...