Microsoft MVP성태의 닷넷 이야기
글쓴 사람
정성태 (techsharer at outlook.com)
홈페이지
첨부 파일
 

Visual Studio 빌드 오류 - result: unexpected exception occured (-1002 - 0xfffffc16)

Fake가 포함된 단위 테스트 프로젝트 빌드 시 다음과 같은 오류가 발생합니다.

1>------ Build started: Project: TestLibUnitTest, Configuration: Debug Any CPU ------
1>Build started 2019-07-08 오전 11:52:39.
1>BuildFakesAssemblies:
1>  Collecting outdated Fakes assemblies
1>  fakes tools timestamp: 2019-03-26 07:31:33Z
1>  reference assembly paths:
...[생략]...
1>  framework assembly path: C:\Program Files (x86)\Microsoft Visual Studio\2019\Enterprise\Common7\IDE\PublicAssemblies
1>  output path: D:\TestPrj\FakesAssemblies
1>  intermediate path: D:\TestPrj\obj\Debug\Fakes
1>  Fakes: 4 (4 .fakes files)
1>   Fakes\TestLib.fakes
1>   Fakes\mscorlib.fakes
1>   Fakes\System.fakes
1>   Fakes\System.Web.fakes
1>  fakes tool: C:\Program Files (x86)\Microsoft Visual Studio\2019\Enterprise\MSBuild\Microsoft\VisualStudio\v16.0\Fakes\fakes.exe
1>  command line arguments:  /Properties:";PlatformTarget=x64" /msbuildpath:"C:\Program Files (x86)\Microsoft Visual Studio\2019\Enterprise\MSBuild\Current\Bin\msbuild.exe"
1>  result: unexpected exception occured (-1002 - 0xfffffc16)
1>  Fakes assemblies:
1>   D:\TestPrj\FakesAssemblies\TestLib.Fakes.dll
1>   D:\TestPrj\FakesAssemblies\TestLib.Fakes.fakesconfig
1>   D:\TestPrj\FakesAssemblies\System.4.0.0.0.Fakes.dll
1>   D:\TestPrj\FakesAssemblies\System.4.0.0.0.Fakes.fakesconfig
1>   D:\TestPrj\FakesAssemblies\System.Web.4.0.0.0.Fakes.dll
1>   D:\TestPrj\FakesAssemblies\System.Web.4.0.0.0.Fakes.fakesconfig
1>   D:\TestPrj\FakesAssemblies\System.4.0.0.0.Fakes.messages
1>   D:\TestPrj\FakesAssemblies\System.Web.4.0.0.0.Fakes.messages
1>
1>Build FAILED.
1>    0 Warning(s)
1>    0 Error(s)
1>
1>Time Elapsed 00:00:36.52
========== Build: 0 succeeded, 1 failed, 2 up-to-date, 0 skipped ==========

자세히 보면, fakes 파일이 4개인데,

1>  Fakes: 4 (4 .fakes files)
1>   Fakes\TestLib.fakes
1>   Fakes\mscorlib.fakes
1>   Fakes\System.fakes
1>   Fakes\System.Web.fakes

생성된 Fakes.dll은 3개입니다.

1>   D:\TestPrj\FakesAssemblies\TestLib.Fakes.dll
1>   D:\TestPrj\FakesAssemblies\TestLib.Fakes.fakesconfig
1>   D:\TestPrj\FakesAssemblies\System.4.0.0.0.Fakes.dll
1>   D:\TestPrj\FakesAssemblies\System.4.0.0.0.Fakes.fakesconfig
1>   D:\TestPrj\FakesAssemblies\System.Web.4.0.0.0.Fakes.dll
1>   D:\TestPrj\FakesAssemblies\System.Web.4.0.0.0.Fakes.fakesconfig
1>   D:\TestPrj\FakesAssemblies\System.4.0.0.0.Fakes.messages
1>   D:\TestPrj\FakesAssemblies\System.Web.4.0.0.0.Fakes.messages

원인은, DLL을 생성하지 못했던 mscorlib.fakes 파일에 정의한 ShimGeneration과 StubGeneration의 순서에 있었습니다. 즉, 다음과 같은 순서인 경우에 "unexpected exception occured (-1002 - 0xfffffc16)" 오류가 발생했던 것으로,

<Fakes xmlns="http://schemas.microsoft.com/fakes/2011/">
  <Assembly Name="mscorlib" Version="4.0.0.0"/>

    <ShimGeneration>
        <Clear />
        <Add FullName="System.AppDomain"/>
    </ShimGeneration>

    <StubGeneration>
        <Remove Namespace="System.Security.Cryptography.X509Certificates"/>
    </StubGeneration>

</Fakes>

이렇게 순서를 바꾸고 나서는 정상적으로 빌드가 되었습니다.

<Fakes xmlns="http://schemas.microsoft.com/fakes/2011/">
  <Assembly Name="mscorlib" Version="4.0.0.0"/>

    <StubGeneration>
        <Remove Namespace="System.Security.Cryptography.X509Certificates"/>
    </StubGeneration>

    <ShimGeneration>
        <Clear />
        <Add FullName="System.AppDomain"/>
    </ShimGeneration>

</Fakes>

사실, Visual Studio 편집기 화면에서 StubGeneration을 뒤에 둔 경우 빨간색 밑줄이 그어져 오류임을 알리고 있었는데 그걸 무시하고 빌드하는 바람에 발생한 오류였습니다.




[이 글에 대해서 여러분들과 의견을 공유하고 싶습니다. 틀리거나 미흡한 부분 또는 의문 사항이 있으시면 언제든 댓글 남겨주십시오.]





[최초 등록일: ]
[최종 수정일: 7/8/2019 ]

Creative Commons License
이 저작물은 크리에이티브 커먼즈 코리아 저작자표시-비영리-변경금지 2.0 대한민국 라이센스에 따라 이용하실 수 있습니다.
by SeongTae Jeong, mailto:techsharer@outlook.com

비밀번호

댓글 쓴 사람
 




1  2  3  4  5  6  7  8  9  10  11  12  13  [14]  15  ...
NoWriterDateCnt.TitleFile(s)
12052정성태11/15/2019813오류 유형: 578. Azure - 일정(schedule)에 등록한 runbook이 1년 후 실행이 안 되는 문제(Reason - The key used is expired.)
12051정성태12/2/20191835개발 환경 구성: 462. 시작하자마자 비정상 종료하는 프로세스의 메모리 덤프 - procdump [1]
12050정성태9/24/20201163Windows: 165. AcLayers의 API 후킹과 FaultTolerantHeap
12049정성태11/13/2019836.NET Framework: 868. (닷넷 프로세스를 대상으로) 디버거 방식이 아닌 CLR Profiler를 이용해 procdump.exe 기능 구현
12048정성태9/24/20201239Windows: 164. GUID 이름의 볼륨에 해당하는 파티션을 찾는 방법
12047정성태11/12/20191898Windows: 163. 안전하게 eject시킨 USB 장치를 물리적인 재연결 없이 다시 인식시키는 방법
12046정성태11/9/20191000오류 유형: 577. windbg - The call to LoadLibrary(...\sos.dll) failed, Win32 error 0n193
12045정성태10/27/2019798오류 유형: 576. mstest.exe 실행 시 "Visual Studio Enterprise is required to execute the test." 오류 - 두 번째 이야기
12044정성태10/27/2019971오류 유형: 575. mstest.exe - System.Resources.MissingSatelliteAssemblyException: The satellite assembly named "Microsoft.VisualStudio.ProductKeyDialog.resources.dll, ..."
12043정성태10/27/20191059오류 유형: 574. Windows 10 설치 시 오류 - 0xC1900101 - 0x4001E
12042정성태10/26/2019997오류 유형: 573. OneDrive 하위에 위치한 Documents, Desktop 폴더에 대한 권한 변경 시 "Unable to display current owner"
12041정성태10/23/2019800오류 유형: 572. mstest.exe - The load test results database could not be opened.
12040정성태10/23/20191251오류 유형: 571. Unhandled Exception: System.Net.Mail.SmtpException: Transaction failed. The server response was: 5.2.0 STOREDRV.Submission.Exception:SendAsDeniedException.MapiExceptionSendAsDenied
12039정성태10/22/2019913스크립트: 16. cmd.exe의 for 문에서는 ERRORLEVEL이 설정되지 않는 문제
12038정성태10/17/2019735오류 유형: 570. SQL Server 2019 RC1 - SQL Client Connectivity SDK 설치 오류
12037정성태10/15/20191232.NET Framework: 867. C# - Encoding.Default 값을 바꿀 수 있을까요?파일 다운로드1
12036정성태10/21/20192143.NET Framework: 866. C# - 고성능이 필요한 환경에서 GC가 발생하지 않는 네이티브 힙 사용파일 다운로드1
12035정성태10/13/20191096개발 환경 구성: 461. C# 8.0의 #nulable 관련 특성을 .NET Framework 프로젝트에서 사용하는 방법파일 다운로드1
12034정성태1/31/20201369개발 환경 구성: 460. .NET Core 환경에서 (프로젝트가 아닌) C# 코드 파일을 입력으로 컴파일하는 방법 [1]
12033정성태10/19/20202105개발 환경 구성: 459. .NET Framework 프로젝트에서 C# 8.0/9.0 컴파일러를 사용하는 방법
12032정성태11/25/20191328.NET Framework: 865. .NET Core 2.2/3.0 웹 프로젝트를 IIS에서 호스팅(Inproc, out-of-proc)하는 방법 - AspNetCoreModuleV2 소개
12031정성태10/7/2019778오류 유형: 569. Azure Site Extension 업그레이드 시 "System.IO.IOException: There is not enough space on the disk" 예외 발생
12030정성태11/12/20192724.NET Framework: 864. .NET Conf 2019 Korea - "닷넷 17년의 변화 정리 및 닷넷 코어 3.0" 발표 자료 [1]파일 다운로드1
12029정성태9/27/2019956제니퍼 .NET: 29. Jennifersoft provides a trial promotion on its APM solution such as JENNIFER, PHP, and .NET in 2019 and shares the examples of their application.
12028정성태9/26/20191097.NET Framework: 863. C# - Thread.Suspend 호출 시 응용 프로그램 hang 현상을 해결하기 위한 시도파일 다운로드1
12027정성태9/26/2019685오류 유형: 568. Consider app.config remapping of assembly "..." from Version "..." [...] to Version "..." [...] to solve conflict and get rid of warning.
1  2  3  4  5  6  7  8  9  10  11  12  13  [14]  15  ...