Microsoft MVP성태의 닷넷 이야기
글쓴 사람
홈페이지
첨부 파일
 

Windows 환경에서 Octave 패키지 설치하는 방법

octave 패키지를 설치하려면 우선 python 2.7.10 버전이 설치되어 있어야 합니다.

python 2.7.10
; https://www.python.org/downloads/

제 경우에 gaussian 함수가 필요했는데,

Function File: gaussian (m)
Function File: gaussian (m, a)
; https://octave.sourceforge.io/signal/function/gaussian.html

위의 도움말 하단에 "Package: signal"이라고 되어 있으므로 이것을 설치해 보도록 하겠습니다. 방법은 "Help" / "Octave Packages" 메뉴를 통해 접근하는 다음의 글로 쉽게 알 수 있습니다.

About Octave Forge
; https://octave.sourceforge.io/

간단하게, Octave 내의 명령행 창에서 "pkg install" 명령어를 내리면 됩니다.

pkg install -forge package_name 

따라서, 제 경우에는 package_name을 "signal"로 해서 실행했는데,

>> pkg install -forge signal
error: the following dependencies were unsatisfied:
   signal needs control >= 2.4

의존성 해결이 안 되었군요. ^^ "control" 패키지가 필요하다고 하니 다시 다음과 같이 의존성이 있는 패키지를 설치해 주면 됩니다.

pkg install -forge control
pkg install -forge signal

참고로, 해당 패키지들은 tar.gz 파일 그대로 다운로드가 가능합니다.

Packages
; https://octave.sourceforge.io/packages.php

만약, signal 패키지(signal-1.4.0.tar.gz)를 다운로드했다면 Octave 프로그램 상단에 "Current Directory"를 tar.gz가 있는 폴더로 변경하거나, 반대로 tar.gz 파일을 "Current Directory"로 복사한 다음 파일명을 직접 입력해 설치할 수도 있습니다.

pkg install signal-1.4.0.tar.gz

(사실, pkg install -forge 명령어로 설치를 해도 "Current Directory"에 해당 파일을 다운로드하고 설치 후 삭제를 합니다.)




파이썬이 없거나, 파이썬 3.x 버전이 실행되도록 PATH에 설정되어 있는 경우에는 pkg install에서 다음과 같은 식의 오류 메시지를 볼 수 있습니다.

>> pkg install -forge signal
...[생략]...
tar: Archive entry has empty or unreadable filename ... skipping.
tar: Archive entry has empty or unreadable filename ... skipping.
tar: Error exit delayed from previous errors.
error: called from
    unpack at line 251 column 5
    untar at line 47 column 5
    install at line 81 column 9
    pkg at line 394 column 9

반드시 2.7.10 버전을 설치하시고 cmd.exe 창에서 "python.exe"를 실행해 본 후 2.7.10 인터프리터가 뜨는지 확인을 해야 합니다. 만약 3.x 버전이 뜬다면 PATH를 2.7.10으로 맞추고 octave.bat을 실행하면 됩니다.




함수를 실행했는데 다음과 같은 식으로 오류가 뜨면,

>> gaussian(9)
error: 'gaussian' undefined near line 1 column 1

해당 패키지가 설치되어 있지 않아서 그런 것입니다. 다음의 도움말을 통해,

List of Functions by Package
; https://octave.sourceforge.io/functions_by_package.php

원하는 함수를 구현한 패키지를 설치하면 됩니다. 하지만, 패키지의 함수를 실행하려면 명시적으로 로드를 해야 합니다.

>> gaussian(9)
error: 'gaussian' undefined near line 1 column 1

>> pkg load signal

>> gaussian(9)
ans =

  3.3546e-004
  1.1109e-002
  1.3534e-001
  6.0653e-001
  1.0000e+000
  6.0653e-001
  1.3534e-001
  1.1109e-002
  3.3546e-004

>> help gaussian
'gaussian' is a function from the file C:\Octave\OCTAVE~1.1\share\octave\packages\signal-1.4.0\gaussian.m
...[생략]...




설치 시 다음과 같은 오류가 발생할 수 있습니다.

>> pkg install -forge signal
medfilt1.cc: In member function 'void sorted_window::init(const double*, octave_idx_type, octave_idx_ty
pe, octave_idx_type)':
medfilt1.cc:91:42: error: 'bzero' was not declared in this scope
       bzero (buf, zeros * sizeof (double));
                                          ^
make: *** [medfilt1.oct] Error 1
make: Entering directory `/tmp/oct-ZNzODD/signal-1.4.0/src'
C:/Octave/OCTAVE~1.1/bin/mkoctfile-4.2.1.exe -Wall -Wno-deprecated-declarations  __fwht__.cc -o __fwht_
_.oct
C:/Octave/OCTAVE~1.1/bin/mkoctfile-4.2.1.exe -Wall -Wno-deprecated-declarations  __ultrwin__.cc -o __ul
trwin__.oct
C:/Octave/OCTAVE~1.1/bin/mkoctfile-4.2.1.exe -Wall -Wno-deprecated-declarations  -c cl2bp.cc -o cl2bp.o

C:/Octave/OCTAVE~1.1/bin/mkoctfile-4.2.1.exe -Wall -Wno-deprecated-declarations  -c cl2bp_lib.cc -o cl2
bp_lib.o
C:/Octave/OCTAVE~1.1/bin/mkoctfile-4.2.1.exe -Wall -Wno-deprecated-declarations  cl2bp.o cl2bp_lib.o -o
 cl2bp.oct
C:/Octave/OCTAVE~1.1/bin/mkoctfile-4.2.1.exe -Wall -Wno-deprecated-declarations  medfilt1.cc -o medfilt
1.oct
make: Leaving directory `/tmp/oct-ZNzODD/signal-1.4.0/src'

pkg: error running `make' for the signal package.
error: called from
    configure_make at line 95 column 9
    install at line 192 column 7
    pkg at line 394 column 9

검색해 보면, 이에 대한 이슈가 나옵니다.

bug #53849: [octave forge] (signal) error building medfilt1.cc on Windows
; https://savannah.gnu.org/bugs/?53849

따라서 "https://hg.mtmxr.com/octave-signal/archive/3cbff3de1ebc.tar.gz" 파일을 다운로드해 "signal-1.4.0.tar.gz" 파일명으로 변경 후 "pkg install" 명령어로 설치해 줍니다.

>> pkg install signal-1.4.0.tar.gz
For information about changes from previous versions of the signal package, run 'news signal'.




원래 pkg install이 링크로도 가능한 것 같은데, 제 경우 다음과 같이 오류가 발생했습니다.

>> pkg install  https://hg.mtmxr.com/octave-signal/archive/3cbff3de1ebc.tar.gz
warning: file https://hg.mtmxr.com/octave-signal/archive/3cbff3de1ebc.tar.gz does not exist

그래서 3cbff3de1ebc.tar.gz 파일을 다운로드해 다시 시도를 해봤지만,

>> pkg install octave-signal-3cbff3de1ebc.tar.gz
package name 'signal' doesn't correspond to its filename 'octave-signal-3cbff3de1ebc.tar'
error: called from
    install at line 119 column 11
    pkg at line 394 column 9

이번에는 파일 명이 잘못되었다고 합니다. 그래서 octave-signal-3cbff3de1ebc.tar 파일을 signal-1.4.0.tar.gz로 이름 변경 후 설치를 했고 정상적으로 동작을 했습니다.




[이 글에 대해서 여러분들과 의견을 공유하고 싶습니다. 틀리거나 미흡한 부분 또는 의문 사항이 있으시면 언제든 댓글 남겨주십시오.]





[최초 등록일: ]
[최종 수정일: 7/23/2018 ]

Creative Commons License
이 저작물은 크리에이티브 커먼즈 코리아 저작자표시-비영리-변경금지 2.0 대한민국 라이센스에 따라 이용하실 수 있습니다.
by SeongTae Jeong, mailto:techsharer@outlook.com

비밀번호

댓글 쓴 사람
 




1  2  3  4  5  6  7  8  9  10  11  12  13  14  [15]  ...
NoWriterDateCnt.TitleFile(s)
11657정성태8/21/20181740사물인터넷: 30. 릴레이(Relay) 제어파일 다운로드3
11656정성태8/18/2018987사물인터넷: 29. 트랜지스터와 병렬로 연결한 LED파일 다운로드1
11655정성태8/18/20181651사물인터넷: 28. 저항과 병렬로 연결한 LED파일 다운로드1
11654정성태8/18/20181310사물인터넷: 27. 병렬 회로의 저항, 전압 및 전류파일 다운로드1
11653정성태8/18/20181150사물인터넷: 26. 입력 전압에 따른 LED의 전압/저항 변화파일 다운로드1
11652정성태9/11/20181036사물인터넷: 25. 컬렉터 9V, 베이스에 5V와 3.3V 전압으로 테스트하는 C1815 트랜지스터파일 다운로드1
11651정성태9/4/20182074사물인터넷: 24. 9V 전압에서 테스트하는 C1815 트랜지스터파일 다운로드3
11650정성태8/18/20181138사물인터넷: 23. 가변저항으로 분압파일 다운로드1
11649정성태8/14/20181244사물인터넷: 22. 저항에 따른 전류 테스트파일 다운로드1
11648정성태10/17/20181726사물인터넷: 21. 퓨즈를 이용한 회로 보호파일 다운로드3
11647정성태8/8/20181403오류 유형: 476. 음수의 음수는 여전히 음수가 되는 수(절대값이 음수인 수)
11646정성태8/8/20181130오류 유형: 475. gacutil.exe 실행 시 "Failure initializing gacutil" 오류 발생
11645정성태8/8/20181251오류 유형: 474. 닷넷 COM+ - Failed to load the runtime. [1]
11644정성태8/8/20181756디버깅 기술: 118. windbg - 닷넷 개발자를 위한 MEX Debugging Extension 소개
11643정성태8/12/20181864사물인터넷: 20. 아두이노 레오나르도 R3 호환 보드의 3.3v 핀의 LED 전압/전류 테스트 [1]파일 다운로드1
11642정성태8/3/20181757Graphics: 20. Unity - LightMode의 ForwardBase에 따른 _WorldSpaceLightPos0 값 변화
11641정성태8/3/20182400Graphics: 19. Unity로 실습하는 Shader (10) - 빌보드 구현파일 다운로드1
11640정성태8/3/20181917Graphics: 18. Unity - World matrix(unity_ObjectToWorld)로부터 Position, Rotation, Scale 값을 복원하는 방법파일 다운로드1
11639정성태8/2/20181477디버깅 기술: 117. windbg - 덤프 파일로부터 추출한 DLL을 참조하는 방법
11638정성태8/2/20181332오류 유형: 473. windbg - 덤프 파일로부터 추출한 DLL 참조 시 "Resolved file has a bad image, no metadata, or is otherwise inaccessible." 빌드 오류
11637정성태8/1/20181675Graphics: 17. Unity - World matrix(unity_ObjectToWorld)로부터 TRS(이동/회전/크기) 행렬로 복원하는 방법파일 다운로드1
11636정성태8/1/20182462Graphics: 16. 3D 공간에서 두 점이 이루는 각도 구하기파일 다운로드1
11635정성태8/1/20181430오류 유형: 472. C# 컴파일 오류 - Your project is not referencing the ".NETFramework,Version=v3.5" framework.
11634정성태8/1/20181367.NET Framework: 790. .NET Thread 상태가 Cooperative일 때 GC hang 현상 재현 방법파일 다운로드1
11633정성태7/29/20182097Graphics: 15. Unity - shader의 World matrix(unity_ObjectToWorld)를 수작업으로 구성 [1]
11632정성태7/28/20184020Graphics: 14. C# - Unity에서 캐릭터가 바라보는 방향을 기준으로 카메라의 위치 이동 및 회전하는 방법
1  2  3  4  5  6  7  8  9  10  11  12  13  14  [15]  ...