Microsoft MVP성태의 닷넷 이야기
글쓴 사람
정성태 (techsharer at outlook.com)
홈페이지
첨부 파일
 

msbuild 오류 - Could not find a part of the path '%LOCALAPPDATA%\Temp\2\.NETFramework,Version=v4.0.AssemblyAttributes.cs'

이상하군요. 잘 되던 빌드가 다음과 같이 오류가 발생합니다.

d:\temp\TestProject1\TestProject1> msbuild TestProject1.csproj /t:Rebuild
Microsoft (R) Build Engine version 15.9.21+g9802d43bc3 for .NET Framework
Copyright (C) Microsoft Corporation. All rights reserved.

Build started 2019-05-21 오후 7:07:23.
Project "d:\temp\TestProject1\TestProject1\TestProject1.csproj" on node 1 (Rebuild target(s)).
CoreClean:
  Deleting file "d:\temp\TestProject1\TestProject1\obj\Debug\TestProject1.csprojAssemblyReference.cache".
  Deleting file "d:\temp\TestProject1\TestProject1\obj\Debug\TestProject1.csproj.CoreCompileInputs.cache".
C:\Program Files (x86)\Microsoft Visual Studio\2017\Enterprise\MSBuild\15.0\bin\Microsoft.Common.CurrentVersion.targets(3325,5): warning MSB3491: Could not write lines to file "C:\Users\TestUser\AppData\Local\Temp\2\.NETFramework,Version=v4.0.AssemblyAttributes.cs". Could not find a part of the path 'C:\Users\TestUser\AppData\Local\Temp\2\.NETFramework,Version=v4.0.AssemblyAttributes.cs'. [d:\temp\TestProject1\TestProject1\TestProject1.csproj]
  The previous error was converted to a warning because the task was called with ContinueOnError=true.
  Build continuing because "ContinueOnError" on the task "WriteLinesToFile" is set to "true".
CoreCompile:
  C:\Program Files (x86)\Microsoft Visual Studio\2017\Enterprise\MSBuild\15.0\bin\Roslyn\csc.exe /noconfig /nowarn:1701,1702 /nostdlib+ /errorreport:prompt /warn:4 /define:DEBUG;TRACE /highentropyva- /reference:"C:\Program Files (x86)\Microsoft Visual Studio\2017\Enterprise\Common7\IDE\ReferenceAssemblies\v4.0\Microsoft.VisualStudio.QualityTools.LoadTestFramework.dll" /reference:"C:\Program Files (x86)\Microsoft Visual Studio\2017\Enterprise\Common7\IDE\ReferenceAssemblies\v4.0\Microsoft.VisualStudio.QualityTools.UnitTestFramework.dll" /reference:"C:\Program Files (x86)\Microsoft Visual Studio\2017\Enterprise\Common7\IDE\ReferenceAssemblies\v4.0\Microsoft.VisualStudio.QualityTools.WebTestFramework.dll" /reference:"C:\Program Files (x86)\Reference Assemblies\Microsoft\Framework\.NETFramewo
  rk\v4.0\mscorlib.dll" /reference:"C:\Program Files (x86)\Reference Assemblies\Microsoft\Framework\.NETFramework\v4.0\System.Core.dll" /reference:"C:\Program Files (x86)\Reference Assemblies\Microsoft\Framework\.NETFramework\v4.0\System.dll" /reference:"C:\Program Files (x86)\Reference Assemblies\Microsoft\Framework\.NETFramework\v4.0\System.Runtime.Serialization.dll" /reference:"C:\Program Files (x86)\Reference Assemblies\Microsoft\Framework\.NETFramework\v4.0\System.ServiceModel.dll" /reference:"C:\Program Files (x86)\Reference Assemblies\Microsoft\Framework\.NETFramework\v4.0\System.Xml.dll" /debug+ /debug:full /filealign:512 /optimize- /out:obj\Debug\TestProject1.dll /ruleset:"C:\Program Files (x86)\Microsoft Visual Studio\2017\Enterprise\Team Tools\Static Analysis Tools\\Rule Sets\M
  inimumRecommendedRules.ruleset" /target:library /utf8output AdditionalTest.cs "Service References\JenniferTest\Reference.cs" "C:\Users\TestUser\AppData\Local\Temp\2\.NETFramework,Version=v4.0.AssemblyAttributes.cs"
  Using shared compilation with compiler from directory: C:\Program Files (x86)\Microsoft Visual Studio\2017\Enterprise\MSBuild\15.0\bin\Roslyn
CSC : error CS2001: Source file 'C:\Users\TestUser\AppData\Local\Temp\2\.NETFramework,Version=v4.0.AssemblyAttributes.cs' could not be found. [d:\temp\TestProject1\TestProject1\TestProject1.csproj]
Done Building Project "d:\temp\TestProject1\TestProject1\TestProject1.csproj" (Rebuild target(s)) -- FAILED.


Build FAILED.

"d:\temp\TestProject1\TestProject1\TestProject1.csproj" (Rebuild target) (1) ->
(GenerateTargetFrameworkMonikerAttribute target) ->
  C:\Program Files (x86)\Microsoft Visual Studio\2017\Enterprise\MSBuild\15.0\bin\Microsoft.Common.CurrentVersion.targets(3325,5): warning MSB3491: Could not write lines to file "C:\Users\TestUser\AppData\Local\Temp\2\.NETFramework,Version=v4.0.AssemblyAttributes.cs". Could not find a part of the path 'C:\Users\TestUser\AppData\Local\Temp\2\.NETFramework,Version=v4.0.AssemblyAttributes.cs'. [d:\temp\TestProject1\TestProject1\TestProject1.csproj]


"d:\temp\TestProject1\TestProject1\TestProject1.csproj" (Rebuild target) (1) ->
(CoreCompile target) ->
  CSC : error CS2001: Source file 'C:\Users\TestUser\AppData\Local\Temp\2\.NETFramework,Version=v4.0.AssemblyAttributes.cs' could not be found. [d:\temp\TestProject1\TestProject1\TestProject1.csproj]

    1 Warning(s)
    1 Error(s)

Time Elapsed 00:00:01.04

그런데, 해당 명령어를 "관리자 권한"으로 실행하면 정상적으로 빌드가 됩니다. 이때 차이가 나는 점이 있다면 문제가 되는 ".NETFramework,Version=v4.0.AssemblyAttributes.cs" 파일의 경로입니다.

[일반 사용자 권한으로 빌드 오류]
C:\Users\TestUser\AppData\Local\Temp\2\

[관리자 권한으로 정상 빌드]
C:\Users\TestUser\AppData\Local\Temp\

\Temp\ 밑에 붙은 "2"는 RDP 접속 시의 세션 ID에 해당합니다.

그리고 실제로 "%LOCALAPPDATA%\Temp\" 폴더에 가보면 하위에 "2"라는 이름의 폴더가 없습니다. 따라서 이런 경우 "2" 폴더를 생성하면 정상적으로 빌드가 되는 것을 확인할 수 있습니다.




[이 글에 대해서 여러분들과 의견을 공유하고 싶습니다. 틀리거나 미흡한 부분 또는 의문 사항이 있으시면 언제든 댓글 남겨주십시오.]

[연관 글]





[최초 등록일: ]
[최종 수정일: 5/21/2019 ]

Creative Commons License
이 저작물은 크리에이티브 커먼즈 코리아 저작자표시-비영리-변경금지 2.0 대한민국 라이센스에 따라 이용하실 수 있습니다.
by SeongTae Jeong, mailto:techsharer@outlook.com

비밀번호

댓글 쓴 사람
 




... [16]  17  18  19  20  21  22  23  24  25  26  27  28  29  30  ...
NoWriterDateCnt.TitleFile(s)
11973정성태7/4/20191533Linux: 21. 리눅스에서 공유 라이브러리가 로드되지 않는다면?
11972정성태7/3/20191850.NET Framework: 847. JAVA와 .NET 간의 AES 암호화 연동파일 다운로드1
11971정성태7/3/20191700개발 환경 구성: 447. Visual Studio Code에서 OpenCvSharp 개발 환경 구성
11970정성태7/2/20191406오류 유형: 552. 웹 브라우저에서 파일 다운로드 후 "Running security scan"이 끝나지 않는 문제
11969정성태7/7/20191347Math: 63. C# - 3층 구조의 신경망파일 다운로드1
11968정성태7/1/20193599오류 유형: 551. Visual Studio Code에서 Remote-SSH 연결 시 "Opening Remote..." 단계에서 진행되지 않는 문제 [1]
11967정성태7/1/20191417개발 환경 구성: 446. Synology NAS를 Windows 10에서 iSCSI로 연결하는 방법
11966정성태6/30/20191392Math: 62. 활성화 함수에 따른 뉴런의 출력을 그리드 맵으로 시각화파일 다운로드1
11965정성태6/30/20191475.NET Framework: 846. C# - 2차원 배열을 1차원 배열로 나열하는 확장 메서드파일 다운로드1
11964정성태6/30/20191896Linux: 20. C# - Linux에서의 Named Pipe를 이용한 통신
11963정성태6/29/20191771Linux: 19. C# - .NET Core Unix Domain Socket 사용 예제
11962정성태6/27/20191163Math: 61. C# - 로지스틱 회귀를 이용한 선형분리 불가능 문제의 분류파일 다운로드1
11961정성태6/27/2019947Graphics: 37. C# - PLplot - 출력 모음(Family File Output)
11960정성태6/27/20191320Graphics: 36. C# - PLplot의 16색 이상을 표현하는 방법과 subpage를 이용한 그리드 맵 표현
11959정성태6/27/20191077Graphics: 35. matplotlib와 PLplot의 한글 처리
11958정성태6/25/20192635Linux: 18. C# - .NET Core Console로 리눅스 daemon 프로그램 만드는 방법 [1]
11957정성태6/24/20193035Windows: 160. WMI 쿼리를 명령행에서 간단하게 수행하는 wmic.exe [1]
11956정성태6/24/20192175Linux: 17. CentOS 7에서 .NET Core Web App 실행 환경 구성 [1]
11955정성태6/20/20191567Math: 60. C# - 로지스틱 회귀를 이용한 분류파일 다운로드1
11954정성태6/20/20192044오류 유형: 550. scp - sudo: no tty present and no askpass program specified
11953정성태6/20/20191282오류 유형: 549. The library 'libhostpolicy.so' required to execute the application was not found in '...'
11952정성태6/20/20191591Linux: 16. 우분투, Centos의 Netbios 호스트 이름 풀이 방법
11951정성태6/20/20191924오류 유형: 548. scp 연결 시 "Permission denied" 오류 및 "WARNING: REMOTE HOST IDENTIFICATION HAS CHANGED!" 경고
11950정성태6/18/20192065.NET Framework: 845. C# - 윈도우 작업 관리자와 리소스 모니터의 메모리 값을 구하는 방법
11949정성태6/18/20191105오류 유형: 547. CoreCLR Profiler 예제 프로젝트 빌드 시 컴파일 오류 유형
11948정성태6/17/20191314Linux: 15. 리눅스 환경의 Visual Studio Code에서 TFS 서버 연동
... [16]  17  18  19  20  21  22  23  24  25  26  27  28  29  30  ...