Microsoft MVP성태의 닷넷 이야기
Linux: 13. node.js에서 syslog로 출력하는 방법 [링크 복사], [링크+제목 복사]
조회: 1748
글쓴 사람
정성태 (techsharer at outlook.com)
홈페이지
첨부 파일
 

node.js에서 syslog로 출력하는 방법

일단 node.js 개발 환경을 설치하고,

Ubuntu 16.04/18.04에서 node.js 최신 버전 설치 방법
; https://www.sysnet.pe.kr/2/0/11944

검색해 본 것 중에 다음의 모듈을 선택했습니다.

strongloop/modern-syslog
; https://github.com/strongloop/modern-syslog

$ sudo npm install modern-syslog

> modern-syslog@1.2.0 install /home/testusr/prjaux/node_modules/modern-syslog
> node-gyp rebuild

make: Entering directory '/home/testusr/prjaux/node_modules/modern-syslog/build'
  CXX(target) Release/obj.target/core/core.o
  SOLINK_MODULE(target) Release/obj.target/core.node
  COPY Release/core.node
make: Leaving directory '/home/testusr/prjaux/node_modules/modern-syslog/build'
/home/testusr/prjaux
└─┬ modern-syslog@1.2.0 
  └── nan@2.14.0 

npm WARN enoent ENOENT: no such file or directory, open '/home/testusr/prjaux/package.json'
npm WARN prjaux No description
npm WARN prjaux No repository field.
npm WARN prjaux No README data
npm WARN prjaux No license field.

그런데 실제 사용 시에는,

const syslog = require("modern-syslog")

syslog.info("test")

다음과 같은 오류가 발생합니다.

internal/modules/cjs/loader.js:805
  return process.dlopen(module, path.toNamespacedPath(filename));
                 ^

Error: The module '/home/testusr/prjaux/node_modules/modern-syslog/build/Release/core.node'
was compiled against a different Node.js version using
NODE_MODULE_VERSION 46. This version of Node.js requires
NODE_MODULE_VERSION 64. Please try re-compiling or re-installing
the module (for instance, using `npm rebuild` or `npm install`).
    at Object.Module._extensions..node (internal/modules/cjs/loader.js:805:18)
    at Module.load (internal/modules/cjs/loader.js:653:32)
    at tryModuleLoad (internal/modules/cjs/loader.js:593:12)
    at Function.Module._load (internal/modules/cjs/loader.js:585:3)
    at Module.require (internal/modules/cjs/loader.js:690:17)
    at require (internal/modules/cjs/helpers.js:25:18)
    at Object.<anonymous> (/home/testusr/prjaux/node_modules/modern-syslog/index.js:9:12)
    at Module._compile (internal/modules/cjs/loader.js:776:30)
    at Object.Module._extensions..js (internal/modules/cjs/loader.js:787:10)
    at Module.load (internal/modules/cjs/loader.js:653:32)
[nodemon] app crashed - waiting for file changes before starting...

메시지를 보면, NODE_MODULE_VERSION 46, NODE_MODULE_VERSION 64 차이라고 생각할 수 있으나... process.dlopen 측의 영향이 더 큰 것 같습니다. 어쨌든 이유는 정확히 알 수 없으나 sudo 권한으로 다음과 같이 실행해야 합니다.

$ sudo node app.js
TEST

혹시, sudo 권한 없이 syslog 출력을 할 수 있는 모듈을 알고 있다면 덧글 부탁드립니다. (C/C++에서 sudo가 필요 없었으니, node.js도 굳이 필요하진 않을 듯한데요. ^^)




참고로, 윈도우의 Ubuntu 스토어 앱에서는 /var/log/syslog 파일이 없습니다. 왜냐하면 서비스 자체가 기본적으로 실행되고 있지 않기 때문입니다. 그래서 미리 해당 서비스를 실행해 두어야 합니다.

$ service rsyslog status
 * rsyslogd is not running

$ sudo service rsyslog start
* Starting enhanced syslogd rsyslogd
[Ubuntu]
$ sudo tail -F /var/log/syslog

[CentOS 7]
$ sudo tail -F /var/log/messages




기타, syslog로 검색한 다른 패키지를 설치해봤더니,

Node-Syslog
; https://www.npmjs.com/package/node-syslog

이번엔 설치 단계에서 오류가 발생합니다.

$ npm install node-syslog

> node-syslog@1.2.0 install /home/testusr/prjaux/node_modules/node-syslog
> node-gyp rebuild

gyp WARN download NVM_NODEJS_ORG_MIRROR is deprecated and will be removed in node-gyp v4, please use NODEJS_ORG_MIRROR
gyp WARN download NVM_NODEJS_ORG_MIRROR is deprecated and will be removed in node-gyp v4, please use NODEJS_ORG_MIRROR
gyp WARN download NVM_NODEJS_ORG_MIRROR is deprecated and will be removed in node-gyp v4, please use NODEJS_ORG_MIRROR
make: Entering directory '/home/testusr/prjaux/node_modules/node-syslog/build'
  CXX(target) Release/obj.target/syslog/syslog.o
In file included from ../node-syslog.h:13:0,
                 from ../syslog.cc:1:
../compat.h:27:2: error: #error "Unsupported node.js version."
 #error "Unsupported node.js version."
  ^
../compat.h:62:53: error: ‘FunctionCallback’ has not been declared
                                                     FunctionCallback callback =
                                                     ^
...[생략]...

"Node-Syslog" 문서에 보면,

This module has been tested with:
node.js v0.8.16

0.8.16이라고 하는데, 엄청 옛날 버전인듯하고... 암튼 지원이 안 됩니다. 또 다른 것도 있지만 역시나 오류가 발생합니다.

$ sudo npm install syslog-node
npm WARN lifecycle unixlib@0.1.3~preinstall: cannot run in wd %s %s
 (wd=%s) unixlib@0.1.3 node-waf configure && node-waf build /home/kevin/prjaux/node_modules/.staging/unixlib-b6827233

> node-syslog@1.2.0 install /home/kevin/prjaux/node_modules/node-syslog
> node-gyp rebuild

make: Entering directory '/home/kevin/prjaux/node_modules/node-sysl
og/build'
  CXX(target) Release/obj.target/syslog/syslog.o
In file included from ../node-syslog.h:13:0,
                 from ../syslog.cc:1:
../compat.h:27:2: error: #error "Unsupported node.js version."
 #error "Unsupported node.js version."
  ^~~~~
../compat.h:62:53: error: ‘FunctionCallback’ has not been declared
                                                     FunctionCallback callback =
...[생략]...




[이 글에 대해서 여러분들과 의견을 공유하고 싶습니다. 틀리거나 미흡한 부분 또는 의문 사항이 있으시면 언제든 댓글 남겨주십시오.]





[최초 등록일: ]
[최종 수정일: 6/25/2019 ]

Creative Commons License
이 저작물은 크리에이티브 커먼즈 코리아 저작자표시-비영리-변경금지 2.0 대한민국 라이센스에 따라 이용하실 수 있습니다.
by SeongTae Jeong, mailto:techsharer@outlook.com

비밀번호

댓글 쓴 사람
 




... [16]  17  18  19  20  21  22  23  24  25  26  27  28  29  30  ...
NoWriterDateCnt.TitleFile(s)
12001정성태8/10/20192272.NET Framework: 852. WPF/WinForm에서 UWP의 기능을 이용해 Bluetooth 기기와 Pairing하는 방법
12000정성태8/9/20191696.NET Framework: 851. WinForm/WPF에서 Console 창을 띄워 출력하는 방법파일 다운로드1
11999정성태8/1/20191119오류 유형: 563. C# - .NET Core 2.0 이하의 Unix Domain Socket 사용 시 System.IndexOutOfRangeException 오류
11998정성태7/30/20191413오류 유형: 562. .NET Remoting에서 서비스 호출 시 SYN_SENT로 남는 현상파일 다운로드1
11997정성태7/30/20191969.NET Framework: 850. C# - Excel(을 비롯해 Office 제품군) COM 객체를 제어 후 Excel.exe 프로세스가 남아 있는 문제파일 다운로드1
11996정성태7/25/20192026.NET Framework: 849. C# - Socket의 TIME_WAIT 상태를 없애는 방법파일 다운로드1
11995정성태7/23/20191744.NET Framework: 848. C# - smtp.daum.net 서비스(Implicit SSL)를 이용해 메일 보내는 방법
11994정성태10/22/20192033개발 환경 구성: 454. Azure 가상 머신(VM)에서 SMTP 메일 전송하는 방법파일 다운로드1
11993정성태7/22/20191253오류 유형: 561. Dism.exe 수행 시 "Error: 2 - The system cannot find the file specified." 오류 발생
11992정성태7/22/20191319오류 유형: 560. 서비스 관리자 실행 시 "Windows was unable to open service control manager database on [...]. Error 5: Access is denied." 오류 발생
11991정성태7/18/2019899디버깅 기술: 128. windbg - x64 환경에서 닷넷 예외가 발생한 경우 인자를 확인할 수 없었던 사례
11990정성태3/16/20201850오류 유형: 559. Settings / Update & Security 화면 진입 시 프로그램 종료
11989정성태7/18/2019990Windows: 162. Windows Server 2019 빌드 17763부터 Alt + F4 입력시 곧바로 로그아웃하는 현상
11988정성태7/18/20191707개발 환경 구성: 453. 마이크로소프트가 지정한 모든 Root 인증서를 설치하는 방법
11987정성태7/17/20195028오류 유형: 558. 윈도우 - KMODE_EXCEPTION_NOT_HANDLED 블루스크린(BSOD) 문제
11986정성태7/18/20191078오류 유형: 557. 드라이브 문자를 할당하지 않은 파티션을 탐색기에서 드라이브 문자와 함께 보여주는 문제
11985정성태7/17/20191052개발 환경 구성: 452. msbuild - csproj에 환경 변수 조건 사용
11984정성태7/9/20192016개발 환경 구성: 451. Microsoft Edge (Chromium)을 대상으로 한 Selenium WebDriver 사용법
11983정성태7/8/20191132오류 유형: 556. nodemon - 'mocha' is not recognized as an internal or external command, operable program or batch file.
11982정성태7/8/20191092오류 유형: 555. Visual Studio 빌드 오류 - result: unexpected exception occured (-1002 - 0xfffffc16)
11981정성태7/7/20191429Math: 64. C# - 3층 구조의 신경망(분류)파일 다운로드1
11980정성태7/7/20196015개발 환경 구성: 450. Visual Studio Code의 Java 확장을 이용한 간단한 프로젝트 구축파일 다운로드1
11979정성태7/8/20191663개발 환경 구성: 449. TFS에서 gitlab/github등의 git 서버로 마이그레이션하는 방법
11978정성태7/6/20191422Windows: 161. 계정 정보가 동일하지 않은 PC 간의 인증을 수행하는 방법 [1]
11977정성태7/6/20192591오류 유형: 554. git push - error: RPC failed; HTTP 413 curl 22 The requested URL returned error: 413 Request Entity Too Large
11976정성태7/4/20191540오류 유형: 553. (잘못 인증 한 후) 원격 git repo 재인증 시 "remote: HTTP Basic: Access denied" 오류 발생
... [16]  17  18  19  20  21  22  23  24  25  26  27  28  29  30  ...