Microsoft MVP성태의 닷넷 이야기
글쓴 사람
정성태 (techsharer at outlook.com)
홈페이지
첨부 파일
 

CoreCLR Profiler 예제 프로젝트 빌드 시 컴파일 오류 유형

아래의 예제로,

마이크로소프트의 CoreCLR 프로파일러 리눅스 예제를 Visual Studio F5 원격 디버깅하는 방법
; https://www.sysnet.pe.kr/2/0/11856

프로젝트를 하다보면 이상한 오류를 많이 만나게 됩니다. ^^; 일례로, 다음과 같은 프로그램은 멀쩡히 잘 컴파일이 되다가 C++14 표준으로 다시 컴파일하면,

#include "./bits/parse_numbers.h"

int main()
{
    return 0;
}

이런 오류가 발생합니다.

1>/usr/bin/../lib/gcc/x86_64-linux-gnu/8/../../../../include/c++/8/./bits/parse_numbers.h(51,33): error : unknown template name 'integral_constant'
1>/usr/bin/../lib/gcc/x86_64-linux-gnu/8/../../../../include/c++/8/./bits/parse_numbers.h(53,23): error : unknown type name 'true_type'
1>/usr/bin/../lib/gcc/x86_64-linux-gnu/8/../../../../include/c++/8/./bits/parse_numbers.h(53,23): error :       using __valid = true_type;
1>/usr/bin/../lib/gcc/x86_64-linux-gnu/8/../../../../include/c++/8/./bits/parse_numbers.h(53,23): error :                       ^

첫 번째 "unknown template name 'integral_constant'" 소스 코드는 이렇습니다.

  template<unsigned _Base>
    struct _Digit<_Base, '0'> : integral_constant<unsigned, 0>
    {
      using __valid = true_type;
    };

당연합니다. 말 그대로 integral_constant가 정의되어 있지 않으므로 발생한 것인데, 이것은 type_traits 헤더에 있으므로 다음과 같이 추가해 주면

#include <type_traits>
#include "./bits/parse_numbers.h"

정상적으로 빌드가 됩니다. 물론, 저런 식으로 parse_numbers.h 헤더 파일을 직접 include하는 경우보다는 다른 헤더 파일 내부에 중첩되어 포함되는 것이 대부분이기 때문에 초보자의 경우에는 어디가 문제인지 모르고 헤맬 수가 있습니다. 애당초 parse_numbers.h 헤더 파일 측에서 의존성을 갖고 있는 type_traits를 포함했다면 이런 문제가 없었을 것입니다.




리눅스의 불친절한 헤더 파일 의존성 문제 외에도, 더욱 심각한 것은 CoreCLR이 다중 플랫폼을 목적으로 구성된 소스 코드라서 "cor" 폴더 하위의 헤더 파일 중에 윈도우의 것을 가져오는 것이 많고 그걸로 인해 충돌하는 경우까지 겹칩니다.

예를 들어, 위의 예제에서 다시 다음과 같이 추가하면,

#include <sal.h>
#include <type_traits>
#include "./bits/parse_numbers.h"

이번에도 희한한(?) 오류가 발생합니다.

1>/usr/bin/../lib/gcc/x86_64-linux-gnu/8/../../../../include/c++/8/./bits/parse_numbers.h(53,21): error : expected unqualified-id
1>/usr/bin/../lib/gcc/x86_64-linux-gnu/8/../../../../include/c++/8/./bits/parse_numbers.h(53,21): error :       using __valid = true_type;
1>/usr/bin/../lib/gcc/x86_64-linux-gnu/8/../../../../include/c++/8/./bits/parse_numbers.h(53,21): error :                     ^

1>/usr/bin/../lib/gcc/x86_64-linux-gnu/8/../../../../include/c++/8/./bits/parse_numbers.h(153,21): error : expected unqualified-id
1>/usr/bin/../lib/gcc/x86_64-linux-gnu/8/../../../../include/c++/8/./bits/parse_numbers.h(153,21): error :       using __valid = false_type;
1>/usr/bin/../lib/gcc/x86_64-linux-gnu/8/../../../../include/c++/8/./bits/parse_numbers.h(153,21): error :                     ^

1>/usr/bin/../lib/gcc/x86_64-linux-gnu/8/../../../../include/c++/8/./bits/parse_numbers.h(165,66): error : expected an identifier or template-id after '::'
1>/usr/bin/../lib/gcc/x86_64-linux-gnu/8/../../../../include/c++/8/./bits/parse_numbers.h(167,36): error : use of undeclared identifier '__valid_digit'

문제가 되는 것은 "using __valid = true_type;" 코드인데요, 왜냐하면 sal.h 헤더 파일에 이런 매크로 정의가 포함되어 있기 때문입니다.

#define __valid

따라서 "using = true_type;"과 같은 코드가 되었으므로 오류가 발생하는데, 문제는 sal.h 파일이 "specstrings.h"에 기본 포함되어 있고, 다시 그 헤더 파일은 "cor/src/inc/contract.h", "cor/src/inc/stdmacros.h", "cor/src/pal/inc/rt/palrt.h" 등의 헤더 파일에 추가되어 있다는 점입니다.

이렇게 중첩된 헤더 파일들 속에서 문제가 발생하는 것이므로 역시나 초보자의 경우라면 해결이 매우 힘들 수 있습니다. 어쨌든 위와 같은 상황이라면 일부러 parse_numbers.h 헤더 파일을 최우선으로 포함해 처리하는 식으로 해결해야 합니다.

#include "Test1.h"

#include <type_traits>
#include "./bits/parse_numbers.h"

#include <sal.h>

암튼... 초기 프로젝트 구성을 C++11로 하고 나중에 C++17로 바꾸면서 이런 헤더 파일 정리해 주느라 ^^ 고생 좀 했습니다.




[이 글에 대해서 여러분들과 의견을 공유하고 싶습니다. 틀리거나 미흡한 부분 또는 의문 사항이 있으시면 언제든 댓글 남겨주십시오.]





[최초 등록일: ]
[최종 수정일: 6/18/2019 ]

Creative Commons License
이 저작물은 크리에이티브 커먼즈 코리아 저작자표시-비영리-변경금지 2.0 대한민국 라이센스에 따라 이용하실 수 있습니다.
by SeongTae Jeong, mailto:techsharer@outlook.com

비밀번호

댓글 쓴 사람
 




... [16]  17  18  19  20  21  22  23  24  25  26  27  28  29  30  ...
NoWriterDateCnt.TitleFile(s)
12001정성태8/10/20192272.NET Framework: 852. WPF/WinForm에서 UWP의 기능을 이용해 Bluetooth 기기와 Pairing하는 방법
12000정성태8/9/20191696.NET Framework: 851. WinForm/WPF에서 Console 창을 띄워 출력하는 방법파일 다운로드1
11999정성태8/1/20191119오류 유형: 563. C# - .NET Core 2.0 이하의 Unix Domain Socket 사용 시 System.IndexOutOfRangeException 오류
11998정성태7/30/20191413오류 유형: 562. .NET Remoting에서 서비스 호출 시 SYN_SENT로 남는 현상파일 다운로드1
11997정성태7/30/20191969.NET Framework: 850. C# - Excel(을 비롯해 Office 제품군) COM 객체를 제어 후 Excel.exe 프로세스가 남아 있는 문제파일 다운로드1
11996정성태7/25/20192026.NET Framework: 849. C# - Socket의 TIME_WAIT 상태를 없애는 방법파일 다운로드1
11995정성태7/23/20191744.NET Framework: 848. C# - smtp.daum.net 서비스(Implicit SSL)를 이용해 메일 보내는 방법
11994정성태10/22/20192033개발 환경 구성: 454. Azure 가상 머신(VM)에서 SMTP 메일 전송하는 방법파일 다운로드1
11993정성태7/22/20191253오류 유형: 561. Dism.exe 수행 시 "Error: 2 - The system cannot find the file specified." 오류 발생
11992정성태7/22/20191319오류 유형: 560. 서비스 관리자 실행 시 "Windows was unable to open service control manager database on [...]. Error 5: Access is denied." 오류 발생
11991정성태7/18/2019899디버깅 기술: 128. windbg - x64 환경에서 닷넷 예외가 발생한 경우 인자를 확인할 수 없었던 사례
11990정성태3/16/20201850오류 유형: 559. Settings / Update & Security 화면 진입 시 프로그램 종료
11989정성태7/18/2019990Windows: 162. Windows Server 2019 빌드 17763부터 Alt + F4 입력시 곧바로 로그아웃하는 현상
11988정성태7/18/20191707개발 환경 구성: 453. 마이크로소프트가 지정한 모든 Root 인증서를 설치하는 방법
11987정성태7/17/20195028오류 유형: 558. 윈도우 - KMODE_EXCEPTION_NOT_HANDLED 블루스크린(BSOD) 문제
11986정성태7/18/20191078오류 유형: 557. 드라이브 문자를 할당하지 않은 파티션을 탐색기에서 드라이브 문자와 함께 보여주는 문제
11985정성태7/17/20191052개발 환경 구성: 452. msbuild - csproj에 환경 변수 조건 사용
11984정성태7/9/20192016개발 환경 구성: 451. Microsoft Edge (Chromium)을 대상으로 한 Selenium WebDriver 사용법
11983정성태7/8/20191132오류 유형: 556. nodemon - 'mocha' is not recognized as an internal or external command, operable program or batch file.
11982정성태7/8/20191092오류 유형: 555. Visual Studio 빌드 오류 - result: unexpected exception occured (-1002 - 0xfffffc16)
11981정성태7/7/20191429Math: 64. C# - 3층 구조의 신경망(분류)파일 다운로드1
11980정성태7/7/20196015개발 환경 구성: 450. Visual Studio Code의 Java 확장을 이용한 간단한 프로젝트 구축파일 다운로드1
11979정성태7/8/20191663개발 환경 구성: 449. TFS에서 gitlab/github등의 git 서버로 마이그레이션하는 방법
11978정성태7/6/20191422Windows: 161. 계정 정보가 동일하지 않은 PC 간의 인증을 수행하는 방법 [1]
11977정성태7/6/20192591오류 유형: 554. git push - error: RPC failed; HTTP 413 curl 22 The requested URL returned error: 413 Request Entity Too Large
11976정성태7/4/20191540오류 유형: 553. (잘못 인증 한 후) 원격 git repo 재인증 시 "remote: HTTP Basic: Access denied" 오류 발생
... [16]  17  18  19  20  21  22  23  24  25  26  27  28  29  30  ...