Microsoft MVP성태의 닷넷 이야기
글쓴 사람
홈페이지
첨부 파일
 

Windows 환경에서 Octave 패키지 설치하는 방법

octave 패키지를 설치하려면 우선 python 2.7.10 버전이 설치되어 있어야 합니다.

python 2.7.10
; https://www.python.org/downloads/

제 경우에 gaussian 함수가 필요했는데,

Function File: gaussian (m)
Function File: gaussian (m, a)
; https://octave.sourceforge.io/signal/function/gaussian.html

위의 도움말 하단에 "Package: signal"이라고 되어 있으므로 이것을 설치해 보도록 하겠습니다. 방법은 "Help" / "Octave Packages" 메뉴를 통해 접근하는 다음의 글로 쉽게 알 수 있습니다.

About Octave Forge
; https://octave.sourceforge.io/

간단하게, Octave 내의 명령행 창에서 "pkg install" 명령어를 내리면 됩니다.

pkg install -forge package_name 

따라서, 제 경우에는 package_name을 "signal"로 해서 실행했는데,

>> pkg install -forge signal
error: the following dependencies were unsatisfied:
   signal needs control >= 2.4

의존성 해결이 안 되었군요. ^^ "control" 패키지가 필요하다고 하니 다시 다음과 같이 의존성이 있는 패키지를 설치해 주면 됩니다.

pkg install -forge control
pkg install -forge signal

참고로, 해당 패키지들은 tar.gz 파일 그대로 다운로드가 가능합니다.

Packages
; https://octave.sourceforge.io/packages.php

만약, signal 패키지(signal-1.4.0.tar.gz)를 다운로드했다면 Octave 프로그램 상단에 "Current Directory"를 tar.gz가 있는 폴더로 변경하거나, 반대로 tar.gz 파일을 "Current Directory"로 복사한 다음 파일명을 직접 입력해 설치할 수도 있습니다.

pkg install signal-1.4.0.tar.gz

(사실, pkg install -forge 명령어로 설치를 해도 "Current Directory"에 해당 파일을 다운로드하고 설치 후 삭제를 합니다.)




파이썬이 없거나, 파이썬 3.x 버전이 실행되도록 PATH에 설정되어 있는 경우에는 pkg install에서 다음과 같은 식의 오류 메시지를 볼 수 있습니다.

>> pkg install -forge signal
...[생략]...
tar: Archive entry has empty or unreadable filename ... skipping.
tar: Archive entry has empty or unreadable filename ... skipping.
tar: Error exit delayed from previous errors.
error: called from
    unpack at line 251 column 5
    untar at line 47 column 5
    install at line 81 column 9
    pkg at line 394 column 9

반드시 2.7.10 버전을 설치하시고 cmd.exe 창에서 "python.exe"를 실행해 본 후 2.7.10 인터프리터가 뜨는지 확인을 해야 합니다. 만약 3.x 버전이 뜬다면 PATH를 2.7.10으로 맞추고 octave.bat을 실행하면 됩니다.




함수를 실행했는데 다음과 같은 식으로 오류가 뜨면,

>> gaussian(9)
error: 'gaussian' undefined near line 1 column 1

해당 패키지가 설치되어 있지 않아서 그런 것입니다. 다음의 도움말을 통해,

List of Functions by Package
; https://octave.sourceforge.io/functions_by_package.php

원하는 함수를 구현한 패키지를 설치하면 됩니다. 하지만, 패키지의 함수를 실행하려면 명시적으로 로드를 해야 합니다.

>> gaussian(9)
error: 'gaussian' undefined near line 1 column 1

>> pkg load signal

>> gaussian(9)
ans =

  3.3546e-004
  1.1109e-002
  1.3534e-001
  6.0653e-001
  1.0000e+000
  6.0653e-001
  1.3534e-001
  1.1109e-002
  3.3546e-004

>> help gaussian
'gaussian' is a function from the file C:\Octave\OCTAVE~1.1\share\octave\packages\signal-1.4.0\gaussian.m
...[생략]...




설치 시 다음과 같은 오류가 발생할 수 있습니다.

>> pkg install -forge signal
medfilt1.cc: In member function 'void sorted_window::init(const double*, octave_idx_type, octave_idx_ty
pe, octave_idx_type)':
medfilt1.cc:91:42: error: 'bzero' was not declared in this scope
       bzero (buf, zeros * sizeof (double));
                                          ^
make: *** [medfilt1.oct] Error 1
make: Entering directory `/tmp/oct-ZNzODD/signal-1.4.0/src'
C:/Octave/OCTAVE~1.1/bin/mkoctfile-4.2.1.exe -Wall -Wno-deprecated-declarations  __fwht__.cc -o __fwht_
_.oct
C:/Octave/OCTAVE~1.1/bin/mkoctfile-4.2.1.exe -Wall -Wno-deprecated-declarations  __ultrwin__.cc -o __ul
trwin__.oct
C:/Octave/OCTAVE~1.1/bin/mkoctfile-4.2.1.exe -Wall -Wno-deprecated-declarations  -c cl2bp.cc -o cl2bp.o

C:/Octave/OCTAVE~1.1/bin/mkoctfile-4.2.1.exe -Wall -Wno-deprecated-declarations  -c cl2bp_lib.cc -o cl2
bp_lib.o
C:/Octave/OCTAVE~1.1/bin/mkoctfile-4.2.1.exe -Wall -Wno-deprecated-declarations  cl2bp.o cl2bp_lib.o -o
 cl2bp.oct
C:/Octave/OCTAVE~1.1/bin/mkoctfile-4.2.1.exe -Wall -Wno-deprecated-declarations  medfilt1.cc -o medfilt
1.oct
make: Leaving directory `/tmp/oct-ZNzODD/signal-1.4.0/src'

pkg: error running `make' for the signal package.
error: called from
    configure_make at line 95 column 9
    install at line 192 column 7
    pkg at line 394 column 9

검색해 보면, 이에 대한 이슈가 나옵니다.

bug #53849: [octave forge] (signal) error building medfilt1.cc on Windows
; https://savannah.gnu.org/bugs/?53849

따라서 "https://hg.mtmxr.com/octave-signal/archive/3cbff3de1ebc.tar.gz" 파일을 다운로드해 "signal-1.4.0.tar.gz" 파일명으로 변경 후 "pkg install" 명령어로 설치해 줍니다.

>> pkg install signal-1.4.0.tar.gz
For information about changes from previous versions of the signal package, run 'news signal'.




원래 pkg install이 링크로도 가능한 것 같은데, 제 경우 다음과 같이 오류가 발생했습니다.

>> pkg install  https://hg.mtmxr.com/octave-signal/archive/3cbff3de1ebc.tar.gz
warning: file https://hg.mtmxr.com/octave-signal/archive/3cbff3de1ebc.tar.gz does not exist

그래서 3cbff3de1ebc.tar.gz 파일을 다운로드해 다시 시도를 해봤지만,

>> pkg install octave-signal-3cbff3de1ebc.tar.gz
package name 'signal' doesn't correspond to its filename 'octave-signal-3cbff3de1ebc.tar'
error: called from
    install at line 119 column 11
    pkg at line 394 column 9

이번에는 파일 명이 잘못되었다고 합니다. 그래서 octave-signal-3cbff3de1ebc.tar 파일을 signal-1.4.0.tar.gz로 이름 변경 후 설치를 했고 정상적으로 동작을 했습니다.




[이 글에 대해서 여러분들과 의견을 공유하고 싶습니다. 틀리거나 미흡한 부분 또는 의문 사항이 있으시면 언제든 댓글 남겨주십시오.]





[최초 등록일: ]
[최종 수정일: 7/23/2018 ]

Creative Commons License
이 저작물은 크리에이티브 커먼즈 코리아 저작자표시-비영리-변경금지 2.0 대한민국 라이센스에 따라 이용하실 수 있습니다.
by SeongTae Jeong, mailto:techsharer@outlook.com

비밀번호

댓글 쓴 사람
 




... 16  [17]  18  19  20  21  22  23  24  25  26  27  28  29  30  ...
NoWriterDateCnt.TitleFile(s)
11679정성태8/31/20181658.NET Framework: 792. C# COM 서버에 구독한 COM 이벤트를 C++에서 받는 방법파일 다운로드1
11678정성태8/29/20181404오류 유형: 483. 닷넷 - System.InvalidProgramException
11677정성태8/29/20181200오류 유형: 482. TFS - Could not find a part of the path '...\packages\Microsoft.AspNet.WebApi.5.2.5\.signature.p7s'.
11676정성태8/29/20182355.NET Framework: 791. C# - ElasticSearch를 위한 Client 라이브러리 제작파일 다운로드1
11675정성태8/29/20181612오류 유형: 481. The located assembly's manifest definition does not match the assembly reference.
11674정성태8/29/20181908Phone: 12. Xamarin - 기존 리모컨 기능을 핸드폰의 적외선 송신으로 구현파일 다운로드1
11673정성태8/28/20181583오류 유형: 480. Fritzing 실행 시 Ordinal Not Found 오류
11672정성태8/28/20181370오류 유형: 479. 윈도우 - 시스템 설정에서 도메인 참가를 위한 "Change" 버튼이 비활성화된 경우
11671정성태10/23/20183287사물인터넷: 39. 아두이노에서 적외선 송신기 기본 사용법파일 다운로드1
11670정성태10/17/20182674사물인터넷: 38. 아두이노에서 적외선 수신기 기본 사용법파일 다운로드1
11669정성태8/24/20181788개발 환경 구성: 394. 윈도우 환경에서 elasticsearch의 한글 블로그 검색 인덱스 구성
11668정성태8/28/20181793오류 유형: 478. 윈도우 업데이트(KB4458842) 이후 SQL Server 서비스 시작 오류
11667정성태8/28/20181565오류 유형: 477. "Use Unicode UTF-8 for worldwide language support" 옵션 설정 시 SQL Server 2016 설치 오류 [1]
11666정성태8/22/20181494사물인터넷: 37. 아두이노 - 코딩으로 대신하는 오실레이터 회로의 소리 출력파일 다운로드1
11665정성태8/22/20182084사물인터넷: 36. 오실레이터 회로 동작을 아두이노의 코딩으로 구현하는 방법파일 다운로드1
11664정성태8/22/20182355개발 환경 구성: 393. 윈도우 환경에서 elasticsearch의 한글 형태소 분석기 설치
11663정성태8/25/20183033개발 환경 구성: 392. 윈도우 환경에서 curl.exe를 이용한 elasticsearch 6.x 기본 사용법
11662정성태8/21/20181668사물인터넷: 35. 병렬 회로에서의 커패시터파일 다운로드1
11661정성태8/21/20181595사물인터넷: 34. 트랜지스터 동작 - 컬렉터-이미터 간의 저항 측정파일 다운로드1
11660정성태9/4/20181469사물인터넷: 33. 세라믹 커패시터의 동작 방식파일 다운로드1
11659정성태8/19/20181686사물인터넷: 32. 9V 전압에서 테스트하는 PN2222A 트랜지스터파일 다운로드1
11658정성태8/18/20182570사물인터넷: 31. 커패시터와 RC 회로파일 다운로드3
11657정성태8/21/20182096사물인터넷: 30. 릴레이(Relay) 제어파일 다운로드3
11656정성태8/18/20181254사물인터넷: 29. 트랜지스터와 병렬로 연결한 LED파일 다운로드1
11655정성태8/18/20182114사물인터넷: 28. 저항과 병렬로 연결한 LED파일 다운로드1
11654정성태8/18/20181620사물인터넷: 27. 병렬 회로의 저항, 전압 및 전류파일 다운로드1
... 16  [17]  18  19  20  21  22  23  24  25  26  27  28  29  30  ...