Microsoft MVP성태의 닷넷 이야기
글쓴 사람
정성태 (techsharer at outlook.com)
홈페이지
첨부 파일
 

.NET Core 2.2 빌드 - error MSB4018: The "RazorTagHelper" task failed unexpectedly.

이상하군요, .NET Core 2.0/2.1 프로젝트는 괜찮은데 유독 2.2 프로젝트에서만 빌드 오류가 발생합니다.

Rebuild started...
1>------ Rebuild All started: Project: CoreCoreWin2, Configuration: Debug Any CPU ------
1>C:\Program Files\dotnet\sdk\5.0.100\Sdks\Microsoft.NET.Sdk\targets\Microsoft.NET.EolTargetFrameworks.targets(28,5): warning NETSDK1138: The target framework 'netcoreapp2.2' is out of support and will not receive security updates in the future. Please refer to https://aka.ms/dotnet-core-support for more information about the support policy.
1>D:\workshop2\JenniferV\gitlab\UnitTest\AzureWebApps\AzureWebTest\CoreCoreWin2\Pages\Index.cshtml.cs(142,36,142,49): warning CS1998: This async method lacks 'await' operators and will run synchronously. Consider using the 'await' operator to await non-blocking API calls, or 'await Task.Run(...)' to do CPU-bound work on a background thread.
1>F:\nuget_root\microsoft.aspnetcore.razor.design\2.2.0\build\netstandard2.0\Microsoft.AspNetCore.Razor.Design.CodeGeneration.targets(79,5): error MSB4018: The "RazorTagHelper" task failed unexpectedly.
1>F:\nuget_root\microsoft.aspnetcore.razor.design\2.2.0\build\netstandard2.0\Microsoft.AspNetCore.Razor.Design.CodeGeneration.targets(79,5): error MSB4018: System.InvalidOperationException: DOTNET_HOST_PATH is not set
1>F:\nuget_root\microsoft.aspnetcore.razor.design\2.2.0\build\netstandard2.0\Microsoft.AspNetCore.Razor.Design.CodeGeneration.targets(79,5): error MSB4018:    at Microsoft.AspNetCore.Razor.Tasks.DotNetToolTask.get_DotNetPath()
1>F:\nuget_root\microsoft.aspnetcore.razor.design\2.2.0\build\netstandard2.0\Microsoft.AspNetCore.Razor.Design.CodeGeneration.targets(79,5): error MSB4018:    at Microsoft.AspNetCore.Razor.Tasks.DotNetToolTask.GenerateFullPathToTool()
1>F:\nuget_root\microsoft.aspnetcore.razor.design\2.2.0\build\netstandard2.0\Microsoft.AspNetCore.Razor.Design.CodeGeneration.targets(79,5): error MSB4018:    at Microsoft.Build.Utilities.ToolTask.ComputePathToTool()
1>F:\nuget_root\microsoft.aspnetcore.razor.design\2.2.0\build\netstandard2.0\Microsoft.AspNetCore.Razor.Design.CodeGeneration.targets(79,5): error MSB4018:    at Microsoft.Build.Utilities.ToolTask.Execute()
1>F:\nuget_root\microsoft.aspnetcore.razor.design\2.2.0\build\netstandard2.0\Microsoft.AspNetCore.Razor.Design.CodeGeneration.targets(79,5): error MSB4018:    at Microsoft.AspNetCore.Razor.Tasks.DotNetToolTask.Execute()
1>F:\nuget_root\microsoft.aspnetcore.razor.design\2.2.0\build\netstandard2.0\Microsoft.AspNetCore.Razor.Design.CodeGeneration.targets(79,5): error MSB4018:    at Microsoft.Build.BackEnd.TaskExecutionHost.Microsoft.Build.BackEnd.ITaskExecutionHost.Execute()
1>F:\nuget_root\microsoft.aspnetcore.razor.design\2.2.0\build\netstandard2.0\Microsoft.AspNetCore.Razor.Design.CodeGeneration.targets(79,5): error MSB4018:    at Microsoft.Build.BackEnd.TaskBuilder.<ExecuteInstantiatedTask>d__26.MoveNext()
1>Done building project "CoreCoreWin2.csproj" -- FAILED.
========== Rebuild All: 0 succeeded, 1 failed, 0 skipped ==========

DOTNET_HOST_PATH가 설정되어 있지 않다고 하는데, 실제로 검색해 보면,

Build is failing for Microsoft.NET.Sdk.Razor project
; https://developercommunity2.visualstudio.com/t/Build-is-failing-for-MicrosoftNETSdkR/1251808?preview=true

해결책으로 환경 변수 설정이 필요하다고 합니다.

환경 변수 이름: DOTNET_HOST_PATH
환경 변숫값: dotnet

path라는 이름에서 dotnet.exe가 있는 경로를 지정해야 할 것 같지만,

%ProgramFiles%\dotnet\dotnet.exe

환경 변수 PATH에 경로가 잡혀 있는 경우 dotnet만 있어도 잘 동작합니다.




[이 글에 대해서 여러분들과 의견을 공유하고 싶습니다. 틀리거나 미흡한 부분 또는 의문 사항이 있으시면 언제든 댓글 남겨주십시오.]



donaricano-btn



[최초 등록일: ]
[최종 수정일: 12/1/2020]

Creative Commons License
이 저작물은 크리에이티브 커먼즈 코리아 저작자표시-비영리-변경금지 2.0 대한민국 라이센스에 따라 이용하실 수 있습니다.
by SeongTae Jeong, mailto:techsharer at outlook.com

비밀번호

댓글 쓴 사람
 




... 16  [17]  18  19  20  21  22  23  24  25  26  27  28  29  30  ...
NoWriterDateCnt.TitleFile(s)
12451정성태12/14/20201257Windows: 182. WMI Namespace를 열거하고, 그 안에 정의된 클래스를 열거하는 방법
12450정성태12/13/20201522.NET Framework: 983. C# - TIME_WAIT과 ephemeral port 재사용파일 다운로드1
12449정성태12/11/20201868.NET Framework: 982. C# - HttpClient에서의 ephemeral port 재사용 [2]파일 다운로드1
12448정성태12/11/20203021.NET Framework: 981. C# - HttpWebRequest, WebClient와 ephemeral port 재사용파일 다운로드1
12447정성태12/10/20201712.NET Framework: 980. C# - CopyFileEx API 사용 예제 코드파일 다운로드1
12446정성태12/10/20201648.NET Framework: 979. C# - CoCreateInstanceEx 사용 예제 코드파일 다운로드1
12445정성태12/8/20201366오류 유형: 692. C# Marshal.PtrToStructure - The structure must not be a value class.파일 다운로드1
12444정성태12/8/20201433.NET Framework: 978. C# - GUID 타입 전용의 UnmanagedType.LPStruct파일 다운로드1
12443정성태12/8/20201307.NET Framework: 977. C# PInvoke - C++의 매개변수에 대한 마샬링을 tlbexp.exe를 이용해 확인하는 방법
12442정성태12/4/20201360오류 유형: 691. Visual Studio - Build Events에 robocopy를 사용할때 "Invalid Parameter #1" 오류가 발행하는 경우
12441정성태12/4/20201125오류 유형: 690. robocopy - ERROR : No Destination Directory Specified.
12440정성태12/4/20201225오류 유형: 689. SignTool Error: Invalid option: /as
12439정성태12/4/20201543디버깅 기술: 176. windbg - 특정 Win32 API에서 BP가 안 걸리는 경우 (2)
12438정성태12/2/20201491오류 유형: 688. .Visual C++ - Error C2011 'sockaddr': 'struct' type redefinition
12437정성태12/1/20201427VS.NET IDE: 155. pfx의 암호 키 파일을 Visual Studio 없이 등록하는 방법
12436정성태12/1/20201584오류 유형: 687. .NET Core 2.2 빌드 - error MSB4018: The "RazorTagHelper" task failed unexpectedly.
12435정성태12/1/20204595Windows: 181. 윈도우 환경에서 클라이언트 소켓의 최대 접속 수 (4) - ReuseUnicastPort를 이용한 포트 고갈 문제 해결파일 다운로드1
12434정성태11/30/20201611Windows: 180. C# - dynamicport 값의 범위를 알아내는 방법
12433정성태11/29/20201474Windows: 179. 윈도우 환경에서 클라이언트 소켓의 최대 접속 수 (3) - SO_PORT_SCALABILITY파일 다운로드1
12432정성태11/29/20201818Windows: 178. 윈도우 환경에서 클라이언트 소켓의 최대 접속 수 (2) - SO_REUSEADDR [1]파일 다운로드1
12431정성태11/27/20201388.NET Framework: 976. UnmanagedCallersOnly + C# 9.0 함수 포인터 사용 시 x86 빌드에서 오동작하는 문제파일 다운로드1
12430정성태11/27/20201719오류 유형: 686. Ubuntu - E: The repository 'cdrom://...' does not have a Release file.
12429정성태11/25/20201541디버깅 기술: 175. windbg - 특정 Win32 API에서 BP가 안 걸리는 경우
12428정성태11/25/20201306VS.NET IDE: 154. Visual Studio - .NET Core App 실행 시 dotnet.exe 실행 화면만 나오는 문제
12427정성태11/24/20201582.NET Framework: 975. .NET Core를 직접 호스팅해 (runtimeconfig.json 없이) EXE만 배포해 실행파일 다운로드1
12426정성태11/24/20201407오류 유형: 685. WinDbg Preview - error InitTypeRead
... 16  [17]  18  19  20  21  22  23  24  25  26  27  28  29  30  ...