Microsoft MVP성태의 닷넷 이야기
글쓴 사람
정성태 (techsharer at outlook.com)
홈페이지
첨부 파일
 

msbuild 오류 - Could not find a part of the path '%LOCALAPPDATA%\Temp\2\.NETFramework,Version=v4.0.AssemblyAttributes.cs'

이상하군요. 잘 되던 빌드가 다음과 같이 오류가 발생합니다.

d:\temp\TestProject1\TestProject1> msbuild TestProject1.csproj /t:Rebuild
Microsoft (R) Build Engine version 15.9.21+g9802d43bc3 for .NET Framework
Copyright (C) Microsoft Corporation. All rights reserved.

Build started 2019-05-21 오후 7:07:23.
Project "d:\temp\TestProject1\TestProject1\TestProject1.csproj" on node 1 (Rebuild target(s)).
CoreClean:
  Deleting file "d:\temp\TestProject1\TestProject1\obj\Debug\TestProject1.csprojAssemblyReference.cache".
  Deleting file "d:\temp\TestProject1\TestProject1\obj\Debug\TestProject1.csproj.CoreCompileInputs.cache".
C:\Program Files (x86)\Microsoft Visual Studio\2017\Enterprise\MSBuild\15.0\bin\Microsoft.Common.CurrentVersion.targets(3325,5): warning MSB3491: Could not write lines to file "C:\Users\TestUser\AppData\Local\Temp\2\.NETFramework,Version=v4.0.AssemblyAttributes.cs". Could not find a part of the path 'C:\Users\TestUser\AppData\Local\Temp\2\.NETFramework,Version=v4.0.AssemblyAttributes.cs'. [d:\temp\TestProject1\TestProject1\TestProject1.csproj]
  The previous error was converted to a warning because the task was called with ContinueOnError=true.
  Build continuing because "ContinueOnError" on the task "WriteLinesToFile" is set to "true".
CoreCompile:
  C:\Program Files (x86)\Microsoft Visual Studio\2017\Enterprise\MSBuild\15.0\bin\Roslyn\csc.exe /noconfig /nowarn:1701,1702 /nostdlib+ /errorreport:prompt /warn:4 /define:DEBUG;TRACE /highentropyva- /reference:"C:\Program Files (x86)\Microsoft Visual Studio\2017\Enterprise\Common7\IDE\ReferenceAssemblies\v4.0\Microsoft.VisualStudio.QualityTools.LoadTestFramework.dll" /reference:"C:\Program Files (x86)\Microsoft Visual Studio\2017\Enterprise\Common7\IDE\ReferenceAssemblies\v4.0\Microsoft.VisualStudio.QualityTools.UnitTestFramework.dll" /reference:"C:\Program Files (x86)\Microsoft Visual Studio\2017\Enterprise\Common7\IDE\ReferenceAssemblies\v4.0\Microsoft.VisualStudio.QualityTools.WebTestFramework.dll" /reference:"C:\Program Files (x86)\Reference Assemblies\Microsoft\Framework\.NETFramewo
  rk\v4.0\mscorlib.dll" /reference:"C:\Program Files (x86)\Reference Assemblies\Microsoft\Framework\.NETFramework\v4.0\System.Core.dll" /reference:"C:\Program Files (x86)\Reference Assemblies\Microsoft\Framework\.NETFramework\v4.0\System.dll" /reference:"C:\Program Files (x86)\Reference Assemblies\Microsoft\Framework\.NETFramework\v4.0\System.Runtime.Serialization.dll" /reference:"C:\Program Files (x86)\Reference Assemblies\Microsoft\Framework\.NETFramework\v4.0\System.ServiceModel.dll" /reference:"C:\Program Files (x86)\Reference Assemblies\Microsoft\Framework\.NETFramework\v4.0\System.Xml.dll" /debug+ /debug:full /filealign:512 /optimize- /out:obj\Debug\TestProject1.dll /ruleset:"C:\Program Files (x86)\Microsoft Visual Studio\2017\Enterprise\Team Tools\Static Analysis Tools\\Rule Sets\M
  inimumRecommendedRules.ruleset" /target:library /utf8output AdditionalTest.cs "Service References\JenniferTest\Reference.cs" "C:\Users\TestUser\AppData\Local\Temp\2\.NETFramework,Version=v4.0.AssemblyAttributes.cs"
  Using shared compilation with compiler from directory: C:\Program Files (x86)\Microsoft Visual Studio\2017\Enterprise\MSBuild\15.0\bin\Roslyn
CSC : error CS2001: Source file 'C:\Users\TestUser\AppData\Local\Temp\2\.NETFramework,Version=v4.0.AssemblyAttributes.cs' could not be found. [d:\temp\TestProject1\TestProject1\TestProject1.csproj]
Done Building Project "d:\temp\TestProject1\TestProject1\TestProject1.csproj" (Rebuild target(s)) -- FAILED.


Build FAILED.

"d:\temp\TestProject1\TestProject1\TestProject1.csproj" (Rebuild target) (1) ->
(GenerateTargetFrameworkMonikerAttribute target) ->
  C:\Program Files (x86)\Microsoft Visual Studio\2017\Enterprise\MSBuild\15.0\bin\Microsoft.Common.CurrentVersion.targets(3325,5): warning MSB3491: Could not write lines to file "C:\Users\TestUser\AppData\Local\Temp\2\.NETFramework,Version=v4.0.AssemblyAttributes.cs". Could not find a part of the path 'C:\Users\TestUser\AppData\Local\Temp\2\.NETFramework,Version=v4.0.AssemblyAttributes.cs'. [d:\temp\TestProject1\TestProject1\TestProject1.csproj]


"d:\temp\TestProject1\TestProject1\TestProject1.csproj" (Rebuild target) (1) ->
(CoreCompile target) ->
  CSC : error CS2001: Source file 'C:\Users\TestUser\AppData\Local\Temp\2\.NETFramework,Version=v4.0.AssemblyAttributes.cs' could not be found. [d:\temp\TestProject1\TestProject1\TestProject1.csproj]

    1 Warning(s)
    1 Error(s)

Time Elapsed 00:00:01.04

그런데, 해당 명령어를 "관리자 권한"으로 실행하면 정상적으로 빌드가 됩니다. 이때 차이가 나는 점이 있다면 문제가 되는 ".NETFramework,Version=v4.0.AssemblyAttributes.cs" 파일의 경로입니다.

[일반 사용자 권한으로 빌드 오류]
C:\Users\TestUser\AppData\Local\Temp\2\

[관리자 권한으로 정상 빌드]
C:\Users\TestUser\AppData\Local\Temp\

\Temp\ 밑에 붙은 "2"는 RDP 접속 시의 세션 ID에 해당합니다.

그리고 실제로 "%LOCALAPPDATA%\Temp\" 폴더에 가보면 하위에 "2"라는 이름의 폴더가 없습니다. 따라서 이런 경우 "2" 폴더를 생성하면 정상적으로 빌드가 되는 것을 확인할 수 있습니다.




[이 글에 대해서 여러분들과 의견을 공유하고 싶습니다. 틀리거나 미흡한 부분 또는 의문 사항이 있으시면 언제든 댓글 남겨주십시오.]

[연관 글]





[최초 등록일: ]
[최종 수정일: 5/21/2019 ]

Creative Commons License
이 저작물은 크리에이티브 커먼즈 코리아 저작자표시-비영리-변경금지 2.0 대한민국 라이센스에 따라 이용하실 수 있습니다.
by SeongTae Jeong, mailto:techsharer@outlook.com

비밀번호

댓글 쓴 사람
 




... 16  17  18  19  [20]  21  22  23  24  25  26  27  28  29  30  ...
NoWriterDateCnt.TitleFile(s)
11949정성태6/18/20191177오류 유형: 547. CoreCLR Profiler 예제 프로젝트 빌드 시 컴파일 오류 유형
11948정성태6/17/20191441Linux: 15. 리눅스 환경의 Visual Studio Code에서 TFS 서버 연동
11947정성태9/25/20191769Linux: 14. 리눅스 환경에서 TFS 서버 연동
11946정성태6/17/20192504개발 환경 구성: 445. C# - MathNet으로 정규 분포를 따르는 데이터를 생성, PLplot으로 Histogram 표현파일 다운로드1
11945정성태6/25/20191836Linux: 13. node.js에서 syslog로 출력하는 방법
11944정성태6/16/20196041Linux: 12. Ubuntu 16.04/18.04에서 node.js 최신 버전 설치 방법
11943정성태6/15/20192023.NET Framework: 844. C# - 박싱과 언박싱 [1]
11942정성태6/20/20196287개발 환경 구성: 444. 로컬의 Visual Studio Code로 원격 리눅스 머신에 접속해 개발하는 방법 [1]
11941정성태6/13/20191389오류 유형: 546. "message NETSDK1057: You are using a preview version of .NET Core" 빌드 경고 없애는 방법
11940정성태6/13/20191322개발 환경 구성: 443. Visual Studio의 Connection Manager 기능(Remote SSH 관리)을 위한 명령행 도구파일 다운로드1
11939정성태6/13/20191423오류 유형: 545. Managed Debugging Assistant 'FatalExecutionEngineError'
11938정성태6/12/20191780Math: 59. C# - 웨이트 벡터 갱신식을 이용한 퍼셉트론 분류파일 다운로드1
11937정성태6/11/20197133개발 환경 구성: 442. .NET Core 3.0 preview 5를 이용해 Windows Forms/WPF 응용 프로그램 개발 [1]
11936정성태6/10/20191584Math: 58. C# - 최소 자승법의 1차, 2차 수렴 그래프 변화 확인파일 다운로드1
11935정성태5/7/20201853.NET Framework: 843. C# - PLplot 출력을 파일이 아닌 Window 화면으로 변경
11934정성태6/7/20192538VC++: 133. typedef struct와 타입 전방 선언으로 인한 C2371 오류파일 다운로드1
11933정성태6/7/20193556VC++: 132. enum 정의를 C++11의 enum class로 바꿀 때 유의할 사항파일 다운로드1
11932정성태6/7/20191925오류 유형: 544. C++ - fatal error C1017: invalid integer constant expression파일 다운로드1
11931정성태6/6/20191942개발 환경 구성: 441. C# - CairoSharp/GtkSharp 사용을 위한 프로젝트 구성 방법
11930정성태6/26/20192306.NET Framework: 842. .NET Reflection을 대체할 System.Reflection.Metadata 소개 [1]
11929정성태6/5/20191695.NET Framework: 841. Windows Forms/C# - 클립보드에 RTF 텍스트를 복사 및 확인하는 방법
11928정성태6/5/20191627오류 유형: 543. PowerShell 확장 설치 시 "Catalog file '[...].cat' is not found in the contents of the module" 오류 발생
11927정성태6/5/20191917스크립트: 15. PowerShell ISE의 스크립트를 복사 후 PPT/Word에 붙여 넣으면 한글이 깨지는 문제 [1]
11926정성태6/4/20192770오류 유형: 542. Visual Studio - pointer to incomplete class type is not allowed
11925정성태6/4/20192237VC++: 131. Visual C++ - uuid 확장 속성과 __uuidof 확장 연산자파일 다운로드1
11924정성태5/30/20192369Math: 57. C# - 해석학적 방법을 이용한 최소 자승법 [1]파일 다운로드1
... 16  17  18  19  [20]  21  22  23  24  25  26  27  28  29  30  ...