Microsoft MVP성태의 닷넷 이야기
글쓴 사람
정성태 (techsharer at outlook.com)
홈페이지
첨부 파일
 

Visual C++ 컴파일 오류 - fatal error C1090: PDB API call failed, error code '3'

다음과 같은 빌드 오류가 발생한다면?

1>C:\Program Files (x86)\Windows Kits\10\Include\10.0.18362.0\um\oledb.h(647): message : C:\Dropbox\dso_framer_2019_build\MS_DSOFramer_OpenSource_V2.2.1.2\dsofauto.cpp : fatal error C1090: PDB API call failed, error code '3': C:\Dropbox\\dso_framer_2019_build\MS_DSOFramer_OpenSource_V2.2.1.2\Debug\vc142.pdb
1>C:\Program Files (x86)\Microsoft Visual Studio\2019\Enterprise\MSBuild\Microsoft\VC\v160\Microsoft.CppCommon.targets(429,5): error MSB6006: "CL.exe" exited with code 1.
1>Done building project "dsoframer.vcxproj" -- FAILED.

제 경우에, dropbox로 연결된 디렉터리에서 제법 규모 있는 프로젝트를 빌드했을 때 저런 식으로 pdb 오류가 발생했습니다. 동일한 프로젝트를 (동기화하느라 바쁜) dropbox가 관리하지 않는 폴더에 복사해 빌드하면 오류가 발생하지 않습니다.




[이 글에 대해서 여러분들과 의견을 공유하고 싶습니다. 틀리거나 미흡한 부분 또는 의문 사항이 있으시면 언제든 댓글 남겨주십시오.]



donaricano-btn



[최초 등록일: ]
[최종 수정일: 8/12/2019 ]

Creative Commons License
이 저작물은 크리에이티브 커먼즈 코리아 저작자표시-비영리-변경금지 2.0 대한민국 라이센스에 따라 이용하실 수 있습니다.
by SeongTae Jeong, mailto:techsharer at outlook.com

비밀번호

댓글 쓴 사람
 




... 16  17  18  19  [20]  21  22  23  24  25  26  27  28  29  30  ...
NoWriterDateCnt.TitleFile(s)
12065정성태11/25/20191562디버깅 기술: 135. windbg - C# PInvoke 호출 시 마샬링을 담당하는 함수 분석파일 다운로드1
12064정성태11/25/20192201오류 유형: 580. HTTP Error 500.0/500.33 - ANCM In-Process Handler Load Failure
12063정성태11/21/20191965디버깅 기술: 134. windbg - RtlReportCriticalFailure로부터 parameters 정보 찾는 방법
12062정성태12/20/20191553디버깅 기술: 133. windbg - CoTaskMemFree/FreeCoTaskMem에서 발생한 덤프 분석 사례 - 두 번째 이야기
12061정성태9/24/20201698Windows: 167. CoTaskMemAlloc/CoTaskMemFree과 윈도우 Heap의 관계
12060정성태11/21/20191762디버깅 기술: 132. windbg/Visual Studio - HeapFree x64의 동작 분석
12059정성태11/20/20191824디버깅 기술: 131. windbg/Visual Studio - HeapFree x86의 동작 분석
12058정성태11/19/20191762디버깅 기술: 130. windbg - CoTaskMemFree/FreeCoTaskMem에서 발생한 덤프 분석 사례
12057정성태11/18/20191262오류 유형: 579. Visual Studio - Memory 창에서 유효한 주소 영역임에도 "Unable to evaluate the expression." 오류 출력
12056정성태12/4/20202068개발 환경 구성: 464. "Microsoft Visual Studio Installer Projects" 프로젝트로 EXE 서명 및 MSI 파일 서명 방법파일 다운로드1
12055정성태11/17/20191173개발 환경 구성: 463. Visual Studio의 Ctrl + Alt + M, 1 (Memory 1) 등의 단축키가 동작하지 않는 경우
12054정성태11/15/20191722.NET Framework: 869. C# - 일부러 GC Heap을 깨뜨려 GC 수행 시 비정상 종료시키는 예제
12053정성태9/24/20201443Windows: 166. 윈도우 10 - 명령행 창(cmd.exe) 속성에 (DotumChe, GulimChe, GungsuhChe 등의) 한글 폰트가 없는 경우
12052정성태11/15/20191357오류 유형: 578. Azure - 일정(schedule)에 등록한 runbook이 1년 후 실행이 안 되는 문제(Reason - The key used is expired.)
12051정성태12/2/20192741개발 환경 구성: 462. 시작하자마자 비정상 종료하는 프로세스의 메모리 덤프 - procdump [1]
12050정성태9/24/20201815Windows: 165. AcLayers의 API 후킹과 FaultTolerantHeap
12049정성태11/13/20191369.NET Framework: 868. (닷넷 프로세스를 대상으로) 디버거 방식이 아닌 CLR Profiler를 이용해 procdump.exe 기능 구현
12048정성태9/24/20202015Windows: 164. GUID 이름의 볼륨에 해당하는 파티션을 찾는 방법
12047정성태11/12/20192799Windows: 163. 안전하게 eject시킨 USB 장치를 물리적인 재연결 없이 다시 인식시키는 방법
12046정성태11/9/20191464오류 유형: 577. windbg - The call to LoadLibrary(...\sos.dll) failed, Win32 error 0n193
12045정성태10/27/20191220오류 유형: 576. mstest.exe 실행 시 "Visual Studio Enterprise is required to execute the test." 오류 - 두 번째 이야기
12044정성태10/27/20191539오류 유형: 575. mstest.exe - System.Resources.MissingSatelliteAssemblyException: The satellite assembly named "Microsoft.VisualStudio.ProductKeyDialog.resources.dll, ..."
12043정성태10/27/20191716오류 유형: 574. Windows 10 설치 시 오류 - 0xC1900101 - 0x4001E
12042정성태10/26/20191656오류 유형: 573. OneDrive 하위에 위치한 Documents, Desktop 폴더에 대한 권한 변경 시 "Unable to display current owner"
12041정성태10/23/20191370오류 유형: 572. mstest.exe - The load test results database could not be opened.
12040정성태10/23/20191805오류 유형: 571. Unhandled Exception: System.Net.Mail.SmtpException: Transaction failed. The server response was: 5.2.0 STOREDRV.Submission.Exception:SendAsDeniedException.MapiExceptionSendAsDenied
... 16  17  18  19  [20]  21  22  23  24  25  26  27  28  29  30  ...