Microsoft MVP성태의 닷넷 이야기
글쓴 사람
정성태 (techsharer at outlook.com)
홈페이지
첨부 파일
 

XSD 파일을 포함한 프로젝트 - The type or namespace name 'TypedTableBase<>' does not exist in the namespace 'System.Data'

제 경우에, 기존 .NET 4.0 프로젝트를 .NET 4.6으로 Target Framework을 변경했더니, 곧바로 다음과 같은 예외가 발생했습니다.

Rebuild started...
1>------ Rebuild All started: Project: Jennifer40.WebSiteTest4, Configuration: Debug x64 ------
1>C:\temp\MyTestWebApp\AccountDataSet.Designer.cs(280,69,280,95): error CS0234: The type or namespace name 'TypedTableBase<>' does not exist in the namespace 'System.Data' (are you missing an assembly reference?)
1>C:\temp\MyTestWebApp\AccountDataSet.Designer.cs(395,59,395,64): error CS0115: 'AccountDataSet.AccountDataTable.Clone()': no suitable method found to override
1>C:\temp\MyTestWebApp\AccountDataSet.Designer.cs(403,62,403,76): error CS0115: 'AccountDataSet.AccountDataTable.CreateInstance()': no suitable method found to override
1>C:\temp\MyTestWebApp\AccountDataSet.Designer.cs(442,60,442,77): error CS0115: 'AccountDataSet.AccountDataTable.NewRowFromBuilder(DataRowBuilder)': no suitable method found to override
1>C:\temp\MyTestWebApp\AccountDataSet.Designer.cs(448,52,448,62): error CS0115: 'AccountDataSet.AccountDataTable.GetRowType()': no suitable method found to override
1>C:\temp\MyTestWebApp\AccountDataSet.Designer.cs(454,37,454,49): error CS0115: 'AccountDataSet.AccountDataTable.OnRowChanged(DataRowChangeEventArgs)': no suitable method found to override
1>C:\temp\MyTestWebApp\AccountDataSet.Designer.cs(463,37,463,50): error CS0115: 'AccountDataSet.AccountDataTable.OnRowChanging(DataRowChangeEventArgs)': no suitable method found to override
1>C:\temp\MyTestWebApp\AccountDataSet.Designer.cs(472,37,472,49): error CS0115: 'AccountDataSet.AccountDataTable.OnRowDeleted(DataRowChangeEventArgs)': no suitable method found to override
1>C:\temp\MyTestWebApp\AccountDataSet.Designer.cs(481,37,481,50): error CS0115: 'AccountDataSet.AccountDataTable.OnRowDeleting(DataRowChangeEventArgs)': no suitable method found to override
========== Rebuild All: 0 succeeded, 1 failed, 0 skipped ==========

^^ 당황하지 마시고, 위의 경우 오류가 난 파일명이 AccountDataSet.Designer.cs 파일인데요, 그렇다면 해당 프로젝트에 AccountDataSet.xsd 파일이 있을 것입니다. 그 파일을 열어서 단순히 "Ctrl + S(Save)" 키를 눌러 한 번 더 저장하면 AccountDataSet.Designer.cs 파일의 소스 코드가 다시 재생성됩니다.

이후로 빌드하면 오류 메시지가 사라져 있을 것입니다.




[이 글에 대해서 여러분들과 의견을 공유하고 싶습니다. 틀리거나 미흡한 부분 또는 의문 사항이 있으시면 언제든 댓글 남겨주십시오.]



donaricano-btn



[최초 등록일: ]
[최종 수정일: 5/3/2021

Creative Commons License
이 저작물은 크리에이티브 커먼즈 코리아 저작자표시-비영리-변경금지 2.0 대한민국 라이센스에 따라 이용하실 수 있습니다.
by SeongTae Jeong, mailto:techsharer at outlook.com

비밀번호

댓글 쓴 사람
 




1  2  [3]  4  5  6  7  8  9  10  11  12  13  14  15  ...
NoWriterDateCnt.TitleFile(s)
12706정성태7/14/2021210.NET Framework: 1076. C# - AsyncLocal 기능을 CallContext만으로 구현하는 방법 [1]파일 다운로드1
12705정성태7/13/2021204VS.NET IDE: 168. x64 DLL 프로젝트의 컨트롤이 Visual Studio의 Designer에서 보이지 않는 문제 - 두 번째 이야기
12704정성태7/12/2021134개발 환경 구성: 576. Azure VM의 서비스를 Azure Web App Service에서만 접근하도록 NSG 설정을 제한하는 방법
12703정성태7/11/2021120개발 환경 구성: 575. Azure VM에 (ICMP) ping을 허용하는 방법
12702정성태7/11/2021103오류 유형: 733. TaskScheduler에 등록된 wacs.exe의 Let's Encrypt 인증서 업데이트 문제
12701정성태7/9/2021161.NET Framework: 1075. C# - ThreadPool의 스레드는 반환 시 ThreadStatic과 AsyncLocal 값이 초기화 될까요?파일 다운로드1
12700정성태7/8/2021227.NET Framework: 1074. RuntimeType의 메모리 누수? [1]
12699정성태7/8/2021198VS.NET IDE: 167. Visual Studio 디버깅 중 GC Heap 상태를 보여주는 "Show Diagnostic Tools" 메뉴 사용법
12698정성태7/7/2021292오류 유형: 732. Windows 11 업데이트 시 3% 또는 0%에서 다운로드가 멈춘 경우
12697정성태7/7/2021210개발 환경 구성: 574. Windows 11 (Insider Preview) 설치하는 방법
12696정성태7/6/2021247VC++: 146. 운영체제의 스레드 문맥 교환(Context Switch)을 유사하게 구현하는 방법파일 다운로드2
12695정성태7/3/2021262VC++: 145. C 언어의 setjmp/longjmp 기능을 Thread Context를 이용해 유사하게 구현하는 방법파일 다운로드1
12694정성태7/2/2021124Java: 24. Azure - Spring Boot 앱을 Java SE(Embedded Web Server)로 호스팅 시 로그 파일 남기는 방법
12693정성태6/30/2021102오류 유형: 731. Azure Web App Site Extension - Failed to install web app extension [...]. {1}
12692정성태6/30/2021250디버깅 기술: 180. Azure - Web App의 비정상 종료 시 남겨지는 로그 확인
12691정성태6/30/2021160개발 환경 구성: 573. 테스트 용도이지만 테스트에 적합하지 않은 Azure D1 공유(shared) 요금제
12690정성태6/28/2021189Java: 23. Azure - 자바(Java)로 만드는 Web App Service - Tomcat 호스팅
12689정성태6/25/2021190오류 유형: 730. Windows Forms 디자이너 - The class Form1 can be designed, but is not the first class in the file.
12688정성태6/24/2021392.NET Framework: 1073. C# - JSON 역/직렬화 시 리플렉션 손실을 없애는 JsonSrcGen [1]파일 다운로드1
12687정성태6/22/2021148오류 유형: 729. Invalid data: Invalid artifact, java se app service only supports .jar artifact
12686정성태6/21/2021196Java: 22. Azure - 자바(Java)로 만드는 Web App Service - Java SE (Embedded Web Server) 호스팅
12685정성태6/21/2021222Java: 21. Azure Web App Service에 배포된 Java 프로세스의 메모리 및 힙(Heap) 덤프 뜨는 방법
12684정성태6/19/2021189오류 유형: 728. Visual Studio 2022부터 DTE.get_Properties 속성 접근 시 System.MissingMethodException 예외 발생
12683정성태6/18/2021254VS.NET IDE: 166. Visual Studio 2022 - Windows Forms 프로젝트의 x86 DLL 컨트롤이 Designer에서 오류가 발생하는 문제파일 다운로드1
12682정성태6/18/2021228VS.NET IDE: 165. Visual Studio 2022를 위한 Extension 마이그레이션
12681정성태6/18/2021151오류 유형: 727. .NET 2.0 ~ 3.5 + x64 환경에서 System.EnterpriseServices 참조 시 CS8012 경고
1  2  [3]  4  5  6  7  8  9  10  11  12  13  14  15  ...