Microsoft MVP성태의 닷넷 이야기
글쓴 사람
정성태 (techsharer at outlook.com)
홈페이지
첨부 파일
 

msbuild 오류 - Could not find a part of the path '%LOCALAPPDATA%\Temp\2\.NETFramework,Version=v4.0.AssemblyAttributes.cs'

이상하군요. 잘 되던 빌드가 다음과 같이 오류가 발생합니다.

d:\temp\TestProject1\TestProject1> msbuild TestProject1.csproj /t:Rebuild
Microsoft (R) Build Engine version 15.9.21+g9802d43bc3 for .NET Framework
Copyright (C) Microsoft Corporation. All rights reserved.

Build started 2019-05-21 오후 7:07:23.
Project "d:\temp\TestProject1\TestProject1\TestProject1.csproj" on node 1 (Rebuild target(s)).
CoreClean:
  Deleting file "d:\temp\TestProject1\TestProject1\obj\Debug\TestProject1.csprojAssemblyReference.cache".
  Deleting file "d:\temp\TestProject1\TestProject1\obj\Debug\TestProject1.csproj.CoreCompileInputs.cache".
C:\Program Files (x86)\Microsoft Visual Studio\2017\Enterprise\MSBuild\15.0\bin\Microsoft.Common.CurrentVersion.targets(3325,5): warning MSB3491: Could not write lines to file "C:\Users\TestUser\AppData\Local\Temp\2\.NETFramework,Version=v4.0.AssemblyAttributes.cs". Could not find a part of the path 'C:\Users\TestUser\AppData\Local\Temp\2\.NETFramework,Version=v4.0.AssemblyAttributes.cs'. [d:\temp\TestProject1\TestProject1\TestProject1.csproj]
  The previous error was converted to a warning because the task was called with ContinueOnError=true.
  Build continuing because "ContinueOnError" on the task "WriteLinesToFile" is set to "true".
CoreCompile:
  C:\Program Files (x86)\Microsoft Visual Studio\2017\Enterprise\MSBuild\15.0\bin\Roslyn\csc.exe /noconfig /nowarn:1701,1702 /nostdlib+ /errorreport:prompt /warn:4 /define:DEBUG;TRACE /highentropyva- /reference:"C:\Program Files (x86)\Microsoft Visual Studio\2017\Enterprise\Common7\IDE\ReferenceAssemblies\v4.0\Microsoft.VisualStudio.QualityTools.LoadTestFramework.dll" /reference:"C:\Program Files (x86)\Microsoft Visual Studio\2017\Enterprise\Common7\IDE\ReferenceAssemblies\v4.0\Microsoft.VisualStudio.QualityTools.UnitTestFramework.dll" /reference:"C:\Program Files (x86)\Microsoft Visual Studio\2017\Enterprise\Common7\IDE\ReferenceAssemblies\v4.0\Microsoft.VisualStudio.QualityTools.WebTestFramework.dll" /reference:"C:\Program Files (x86)\Reference Assemblies\Microsoft\Framework\.NETFramewo
  rk\v4.0\mscorlib.dll" /reference:"C:\Program Files (x86)\Reference Assemblies\Microsoft\Framework\.NETFramework\v4.0\System.Core.dll" /reference:"C:\Program Files (x86)\Reference Assemblies\Microsoft\Framework\.NETFramework\v4.0\System.dll" /reference:"C:\Program Files (x86)\Reference Assemblies\Microsoft\Framework\.NETFramework\v4.0\System.Runtime.Serialization.dll" /reference:"C:\Program Files (x86)\Reference Assemblies\Microsoft\Framework\.NETFramework\v4.0\System.ServiceModel.dll" /reference:"C:\Program Files (x86)\Reference Assemblies\Microsoft\Framework\.NETFramework\v4.0\System.Xml.dll" /debug+ /debug:full /filealign:512 /optimize- /out:obj\Debug\TestProject1.dll /ruleset:"C:\Program Files (x86)\Microsoft Visual Studio\2017\Enterprise\Team Tools\Static Analysis Tools\\Rule Sets\M
  inimumRecommendedRules.ruleset" /target:library /utf8output AdditionalTest.cs "Service References\JenniferTest\Reference.cs" "C:\Users\TestUser\AppData\Local\Temp\2\.NETFramework,Version=v4.0.AssemblyAttributes.cs"
  Using shared compilation with compiler from directory: C:\Program Files (x86)\Microsoft Visual Studio\2017\Enterprise\MSBuild\15.0\bin\Roslyn
CSC : error CS2001: Source file 'C:\Users\TestUser\AppData\Local\Temp\2\.NETFramework,Version=v4.0.AssemblyAttributes.cs' could not be found. [d:\temp\TestProject1\TestProject1\TestProject1.csproj]
Done Building Project "d:\temp\TestProject1\TestProject1\TestProject1.csproj" (Rebuild target(s)) -- FAILED.


Build FAILED.

"d:\temp\TestProject1\TestProject1\TestProject1.csproj" (Rebuild target) (1) ->
(GenerateTargetFrameworkMonikerAttribute target) ->
  C:\Program Files (x86)\Microsoft Visual Studio\2017\Enterprise\MSBuild\15.0\bin\Microsoft.Common.CurrentVersion.targets(3325,5): warning MSB3491: Could not write lines to file "C:\Users\TestUser\AppData\Local\Temp\2\.NETFramework,Version=v4.0.AssemblyAttributes.cs". Could not find a part of the path 'C:\Users\TestUser\AppData\Local\Temp\2\.NETFramework,Version=v4.0.AssemblyAttributes.cs'. [d:\temp\TestProject1\TestProject1\TestProject1.csproj]


"d:\temp\TestProject1\TestProject1\TestProject1.csproj" (Rebuild target) (1) ->
(CoreCompile target) ->
  CSC : error CS2001: Source file 'C:\Users\TestUser\AppData\Local\Temp\2\.NETFramework,Version=v4.0.AssemblyAttributes.cs' could not be found. [d:\temp\TestProject1\TestProject1\TestProject1.csproj]

    1 Warning(s)
    1 Error(s)

Time Elapsed 00:00:01.04

그런데, 해당 명령어를 "관리자 권한"으로 실행하면 정상적으로 빌드가 됩니다. 이때 차이가 나는 점이 있다면 문제가 되는 ".NETFramework,Version=v4.0.AssemblyAttributes.cs" 파일의 경로입니다.

[일반 사용자 권한으로 빌드 오류]
C:\Users\TestUser\AppData\Local\Temp\2\

[관리자 권한으로 정상 빌드]
C:\Users\TestUser\AppData\Local\Temp\

\Temp\ 밑에 붙은 "2"는 RDP 접속 시의 세션 ID에 해당합니다.

그리고 실제로 "%LOCALAPPDATA%\Temp\" 폴더에 가보면 하위에 "2"라는 이름의 폴더가 없습니다. 따라서 이런 경우 "2" 폴더를 생성하면 정상적으로 빌드가 되는 것을 확인할 수 있습니다.




[이 글에 대해서 여러분들과 의견을 공유하고 싶습니다. 틀리거나 미흡한 부분 또는 의문 사항이 있으시면 언제든 댓글 남겨주십시오.]

[연관 글]


donaricano-btn



[최초 등록일: ]
[최종 수정일: 5/21/2019 ]

Creative Commons License
이 저작물은 크리에이티브 커먼즈 코리아 저작자표시-비영리-변경금지 2.0 대한민국 라이센스에 따라 이용하실 수 있습니다.
by SeongTae Jeong, mailto:techsharer@outlook.com

비밀번호

댓글 쓴 사람
 




... 16  17  18  19  20  [21]  22  23  24  25  26  27  28  29  30  ...
NoWriterDateCnt.TitleFile(s)
12003정성태8/12/20192454오류 유형: 564. Visual C++ 컴파일 오류 - fatal error C1090: PDB API call failed, error code '3'
12002정성태8/12/20191985.NET Framework: 853. Excel Sheet를 WinForm에서 사용하는 방법 - 두 번째 이야기 [5]
12001정성태8/10/20192972.NET Framework: 852. WPF/WinForm에서 UWP의 기능을 이용해 Bluetooth 기기와 Pairing하는 방법
12000정성태8/9/20192231.NET Framework: 851. WinForm/WPF에서 Console 창을 띄워 출력하는 방법파일 다운로드1
11999정성태8/1/20191382오류 유형: 563. C# - .NET Core 2.0 이하의 Unix Domain Socket 사용 시 System.IndexOutOfRangeException 오류
11998정성태7/30/20191773오류 유형: 562. .NET Remoting에서 서비스 호출 시 SYN_SENT로 남는 현상파일 다운로드1
11997정성태7/30/20192432.NET Framework: 850. C# - Excel(을 비롯해 Office 제품군) COM 객체를 제어 후 Excel.exe 프로세스가 남아 있는 문제파일 다운로드1
11996정성태7/25/20192584.NET Framework: 849. C# - Socket의 TIME_WAIT 상태를 없애는 방법파일 다운로드1
11995정성태7/23/20192304.NET Framework: 848. C# - smtp.daum.net 서비스(Implicit SSL)를 이용해 메일 보내는 방법
11994정성태10/22/20192468개발 환경 구성: 454. Azure 가상 머신(VM)에서 SMTP 메일 전송하는 방법파일 다운로드1
11993정성태7/22/20191614오류 유형: 561. Dism.exe 수행 시 "Error: 2 - The system cannot find the file specified." 오류 발생
11992정성태7/22/20191668오류 유형: 560. 서비스 관리자 실행 시 "Windows was unable to open service control manager database on [...]. Error 5: Access is denied." 오류 발생
11991정성태7/18/20191148디버깅 기술: 128. windbg - x64 환경에서 닷넷 예외가 발생한 경우 인자를 확인할 수 없었던 사례
11990정성태3/16/20202180오류 유형: 559. Settings / Update & Security 화면 진입 시 프로그램 종료
11989정성태7/18/20191296Windows: 162. Windows Server 2019 빌드 17763부터 Alt + F4 입력시 곧바로 로그아웃하는 현상
11988정성태7/18/20192094개발 환경 구성: 453. 마이크로소프트가 지정한 모든 Root 인증서를 설치하는 방법
11987정성태7/17/20196240오류 유형: 558. 윈도우 - KMODE_EXCEPTION_NOT_HANDLED 블루스크린(BSOD) 문제
11986정성태7/18/20191326오류 유형: 557. 드라이브 문자를 할당하지 않은 파티션을 탐색기에서 드라이브 문자와 함께 보여주는 문제
11985정성태7/17/20191298개발 환경 구성: 452. msbuild - csproj에 환경 변수 조건 사용
11984정성태7/9/20192706개발 환경 구성: 451. Microsoft Edge (Chromium)을 대상으로 한 Selenium WebDriver 사용법 [1]
11983정성태7/8/20191380오류 유형: 556. nodemon - 'mocha' is not recognized as an internal or external command, operable program or batch file.
11982정성태7/8/20191327오류 유형: 555. Visual Studio 빌드 오류 - result: unexpected exception occured (-1002 - 0xfffffc16)
11981정성태7/7/20191690Math: 64. C# - 3층 구조의 신경망(분류)파일 다운로드1
11980정성태7/7/20197314개발 환경 구성: 450. Visual Studio Code의 Java 확장을 이용한 간단한 프로젝트 구축파일 다운로드1
11979정성태7/8/20192001개발 환경 구성: 449. TFS에서 gitlab/github등의 git 서버로 마이그레이션하는 방법
11978정성태7/6/20191665Windows: 161. 계정 정보가 동일하지 않은 PC 간의 인증을 수행하는 방법 [1]
... 16  17  18  19  20  [21]  22  23  24  25  26  27  28  29  30  ...