Microsoft MVP성태의 닷넷 이야기
글쓴 사람
정성태 (techsharer at outlook.com)
홈페이지
첨부 파일
 

Windows 환경에서 Octave 패키지 설치하는 방법

octave 패키지를 설치하려면 우선 python 2.7.10 버전이 설치되어 있어야 합니다.

python 2.7.10
; https://www.python.org/downloads/

제 경우에 gaussian 함수가 필요했는데,

Function File: gaussian (m)
Function File: gaussian (m, a)
; https://octave.sourceforge.io/signal/function/gaussian.html

위의 도움말 하단에 "Package: signal"이라고 되어 있으므로 이것을 설치해 보도록 하겠습니다. 방법은 "Help" / "Octave Packages" 메뉴를 통해 접근하는 다음의 글로 쉽게 알 수 있습니다.

About Octave Forge
; https://octave.sourceforge.io/

간단하게, Octave 내의 명령행 창에서 "pkg install" 명령어를 내리면 됩니다.

pkg install -forge package_name 

따라서, 제 경우에는 package_name을 "signal"로 해서 실행했는데,

>> pkg install -forge signal
error: the following dependencies were unsatisfied:
   signal needs control >= 2.4

의존성 해결이 안 되었군요. ^^ "control" 패키지가 필요하다고 하니 다시 다음과 같이 의존성이 있는 패키지를 설치해 주면 됩니다.

pkg install -forge control
pkg install -forge signal

참고로, 해당 패키지들은 tar.gz 파일 그대로 다운로드가 가능합니다.

Packages
; https://octave.sourceforge.io/packages.php

만약, signal 패키지(signal-1.4.0.tar.gz)를 다운로드했다면 Octave 프로그램 상단에 "Current Directory"를 tar.gz가 있는 폴더로 변경하거나, 반대로 tar.gz 파일을 "Current Directory"로 복사한 다음 파일명을 직접 입력해 설치할 수도 있습니다.

pkg install signal-1.4.0.tar.gz

(사실, pkg install -forge 명령어로 설치를 해도 "Current Directory"에 해당 파일을 다운로드하고 설치 후 삭제를 합니다.)




파이썬이 없거나, 파이썬 3.x 버전이 실행되도록 PATH에 설정되어 있는 경우에는 pkg install에서 다음과 같은 식의 오류 메시지를 볼 수 있습니다.

>> pkg install -forge signal
...[생략]...
tar: Archive entry has empty or unreadable filename ... skipping.
tar: Archive entry has empty or unreadable filename ... skipping.
tar: Error exit delayed from previous errors.
error: called from
    unpack at line 251 column 5
    untar at line 47 column 5
    install at line 81 column 9
    pkg at line 394 column 9

반드시 2.7.10 버전을 설치하시고 cmd.exe 창에서 "python.exe"를 실행해 본 후 2.7.10 인터프리터가 뜨는지 확인을 해야 합니다. 만약 3.x 버전이 뜬다면 PATH를 2.7.10으로 맞추고 octave.bat을 실행하면 됩니다.




함수를 실행했는데 다음과 같은 식으로 오류가 뜨면,

>> gaussian(9)
error: 'gaussian' undefined near line 1 column 1

해당 패키지가 설치되어 있지 않아서 그런 것입니다. 다음의 도움말을 통해,

List of Functions by Package
; https://octave.sourceforge.io/functions_by_package.php

원하는 함수를 구현한 패키지를 설치하면 됩니다. 하지만, 패키지의 함수를 실행하려면 명시적으로 로드를 해야 합니다.

>> gaussian(9)
error: 'gaussian' undefined near line 1 column 1

>> pkg load signal

>> gaussian(9)
ans =

  3.3546e-004
  1.1109e-002
  1.3534e-001
  6.0653e-001
  1.0000e+000
  6.0653e-001
  1.3534e-001
  1.1109e-002
  3.3546e-004

>> help gaussian
'gaussian' is a function from the file C:\Octave\OCTAVE~1.1\share\octave\packages\signal-1.4.0\gaussian.m
...[생략]...




설치 시 다음과 같은 오류가 발생할 수 있습니다.

>> pkg install -forge signal
medfilt1.cc: In member function 'void sorted_window::init(const double*, octave_idx_type, octave_idx_ty
pe, octave_idx_type)':
medfilt1.cc:91:42: error: 'bzero' was not declared in this scope
       bzero (buf, zeros * sizeof (double));
                                          ^
make: *** [medfilt1.oct] Error 1
make: Entering directory `/tmp/oct-ZNzODD/signal-1.4.0/src'
C:/Octave/OCTAVE~1.1/bin/mkoctfile-4.2.1.exe -Wall -Wno-deprecated-declarations  __fwht__.cc -o __fwht_
_.oct
C:/Octave/OCTAVE~1.1/bin/mkoctfile-4.2.1.exe -Wall -Wno-deprecated-declarations  __ultrwin__.cc -o __ul
trwin__.oct
C:/Octave/OCTAVE~1.1/bin/mkoctfile-4.2.1.exe -Wall -Wno-deprecated-declarations  -c cl2bp.cc -o cl2bp.o

C:/Octave/OCTAVE~1.1/bin/mkoctfile-4.2.1.exe -Wall -Wno-deprecated-declarations  -c cl2bp_lib.cc -o cl2
bp_lib.o
C:/Octave/OCTAVE~1.1/bin/mkoctfile-4.2.1.exe -Wall -Wno-deprecated-declarations  cl2bp.o cl2bp_lib.o -o
 cl2bp.oct
C:/Octave/OCTAVE~1.1/bin/mkoctfile-4.2.1.exe -Wall -Wno-deprecated-declarations  medfilt1.cc -o medfilt
1.oct
make: Leaving directory `/tmp/oct-ZNzODD/signal-1.4.0/src'

pkg: error running `make' for the signal package.
error: called from
    configure_make at line 95 column 9
    install at line 192 column 7
    pkg at line 394 column 9

검색해 보면, 이에 대한 이슈가 나옵니다.

bug #53849: [octave forge] (signal) error building medfilt1.cc on Windows
; https://savannah.gnu.org/bugs/?53849

따라서 "https://hg.mtmxr.com/octave-signal/archive/3cbff3de1ebc.tar.gz" 파일을 다운로드해 "signal-1.4.0.tar.gz" 파일명으로 변경 후 "pkg install" 명령어로 설치해 줍니다.

>> pkg install signal-1.4.0.tar.gz
For information about changes from previous versions of the signal package, run 'news signal'.




원래 pkg install이 링크로도 가능한 것 같은데, 제 경우 다음과 같이 오류가 발생했습니다.

>> pkg install  https://hg.mtmxr.com/octave-signal/archive/3cbff3de1ebc.tar.gz
warning: file https://hg.mtmxr.com/octave-signal/archive/3cbff3de1ebc.tar.gz does not exist

그래서 3cbff3de1ebc.tar.gz 파일을 다운로드해 다시 시도를 해봤지만,

>> pkg install octave-signal-3cbff3de1ebc.tar.gz
package name 'signal' doesn't correspond to its filename 'octave-signal-3cbff3de1ebc.tar'
error: called from
    install at line 119 column 11
    pkg at line 394 column 9

이번에는 파일 명이 잘못되었다고 합니다. 그래서 octave-signal-3cbff3de1ebc.tar 파일을 signal-1.4.0.tar.gz로 이름 변경 후 설치를 했고 정상적으로 동작을 했습니다.




[이 글에 대해서 여러분들과 의견을 공유하고 싶습니다. 틀리거나 미흡한 부분 또는 의문 사항이 있으시면 언제든 댓글 남겨주십시오.]





[최초 등록일: ]
[최종 수정일: 7/23/2018 ]

Creative Commons License
이 저작물은 크리에이티브 커먼즈 코리아 저작자표시-비영리-변경금지 2.0 대한민국 라이센스에 따라 이용하실 수 있습니다.
by SeongTae Jeong, mailto:techsharer@outlook.com

비밀번호

댓글 쓴 사람
 




... 16  17  18  19  20  21  22  23  [24]  25  26  27  28  29  30  ...
NoWriterDateCnt.TitleFile(s)
11851정성태3/19/20192514Linux: 8. C# - 리눅스 환경에서 DllImport 대신 라이브러리 동적 로드 처리
11850정성태3/18/20191705.NET Framework: 813. C# async 메서드에서 out/ref/in 유형의 인자를 사용하지 못하는 이유
11849정성태3/18/20192547.NET Framework: 812. pscp.exe 기능을 C#으로 제어하는 방법파일 다운로드1
11848정성태3/17/20191453스크립트: 14. 윈도우 CMD - 파일이 변경된 경우 파일명을 변경해 복사하고 싶다면?
11847정성태3/17/20193008Linux: 7. 리눅스 C/C++ - 공유 라이브러리 동적 로딩 후 export 함수 사용 방법파일 다운로드1
11846정성태3/15/20192453Linux: 6. getenv, setenv가 언어/운영체제마다 호환이 안 되는 문제
11845정성태3/15/20193220Linux: 5. Linux 응용 프로그램의 (C++) so 의존성 줄이기(ReleaseMinDependency) [3]
11844정성태5/22/20193617개발 환경 구성: 434. Visual Studio 2019 - 리눅스 프로젝트를 이용한 공유/실행(so/out) 프로그램 개발 환경 설정 [1]파일 다운로드1
11843정성태3/14/20191640기타: 75. MSDN 웹 사이트를 기본으로 영문 페이지로 열고 싶다면?
11842정성태5/3/20191521개발 환경 구성: 433. 마이크로소프트의 CoreCLR 프로파일러 예제를 Visual Studio CMake로 빌드하는 방법 [1]파일 다운로드1
11841정성태3/13/20191437VS.NET IDE: 132. Visual Studio 2019 - CMake의 컴파일러를 기본 g++에서 clang++로 변경
11840정성태3/13/20191599오류 유형: 526. 윈도우 10 Ubuntu App 환경에서는 USB 외장 하드 접근 불가
11839정성태3/12/20192287디버깅 기술: 124. .NET Core 웹 앱을 호스팅하는 Azure App Services의 프로세스 메모리 덤프 및 windbg 분석 개요 [3]
11838정성태5/9/20193019.NET Framework: 811. (번역글) .NET Internals Cookbook Part 1 - Exceptions, filters and corrupted processes [1]파일 다운로드1
11837정성태10/14/20199024기타: 74. 도서: 시작하세요! C# 7.3 프로그래밍 [10]
11836정성태10/12/20192368오류 유형: 525. Visual Studio 2019 Preview 4/RC - C# 8.0 Missing compiler required member 'System.Range..ctor' [1]
11835정성태3/5/20192651.NET Framework: 810. C# 8.0의 Index/Range 연산자를 .NET Framework에서 사용하는 방법 및 비동기 스트림의 컴파일 방법 [2]파일 다운로드1
11834정성태3/4/20191977개발 환경 구성: 432. Visual Studio 없이 최신 C# (8.0) 컴파일러를 사용하는 방법
11833정성태5/14/20192608개발 환경 구성: 431. Visual Studio 2019 - CMake를 이용한 공유/실행(so/out) 리눅스 프로젝트 설정파일 다운로드1
11832정성태3/4/20191741오류 유형: 524. Visual Studio CMake - rsync: connection unexpectedly closed
11831정성태3/4/20191456오류 유형: 523. Visual Studio 2019 - 새 창으로 뜬 윈도우를 닫을 때 비정상 종료
11830정성태2/26/20191328오류 유형: 522. 이벤트 로그 - Error opening event log file State. Log will not be processed. Return code from OpenEventLog is 87.
11829정성태12/12/20191678개발 환경 구성: 430. 마이크로소프트의 CoreCLR 프로파일러 예제 빌드 방법 - 리눅스 환경 [1]
11828정성태9/24/20204434개발 환경 구성: 429. Component Services 관리자의 RuntimeBroker 설정이 2개 있는 경우 [3]
11827정성태2/26/20192158오류 유형: 521. Visual Studio - Could not start the 'rsync' command on the remote host, please install it using your system package manager.
11826정성태2/26/20191781오류 유형: 520. 우분투에 .NET Core SDK 설치 시 패키지 의존성 오류
... 16  17  18  19  20  21  22  23  [24]  25  26  27  28  29  30  ...