Microsoft MVP성태의 닷넷 이야기
Linux: 13. node.js에서 syslog로 출력하는 방법 [링크 복사], [링크+제목 복사]
조회: 1772
글쓴 사람
정성태 (techsharer at outlook.com)
홈페이지
첨부 파일
 

node.js에서 syslog로 출력하는 방법

일단 node.js 개발 환경을 설치하고,

Ubuntu 16.04/18.04에서 node.js 최신 버전 설치 방법
; https://www.sysnet.pe.kr/2/0/11944

검색해 본 것 중에 다음의 모듈을 선택했습니다.

strongloop/modern-syslog
; https://github.com/strongloop/modern-syslog

$ sudo npm install modern-syslog

> modern-syslog@1.2.0 install /home/testusr/prjaux/node_modules/modern-syslog
> node-gyp rebuild

make: Entering directory '/home/testusr/prjaux/node_modules/modern-syslog/build'
  CXX(target) Release/obj.target/core/core.o
  SOLINK_MODULE(target) Release/obj.target/core.node
  COPY Release/core.node
make: Leaving directory '/home/testusr/prjaux/node_modules/modern-syslog/build'
/home/testusr/prjaux
└─┬ modern-syslog@1.2.0 
  └── nan@2.14.0 

npm WARN enoent ENOENT: no such file or directory, open '/home/testusr/prjaux/package.json'
npm WARN prjaux No description
npm WARN prjaux No repository field.
npm WARN prjaux No README data
npm WARN prjaux No license field.

그런데 실제 사용 시에는,

const syslog = require("modern-syslog")

syslog.info("test")

다음과 같은 오류가 발생합니다.

internal/modules/cjs/loader.js:805
  return process.dlopen(module, path.toNamespacedPath(filename));
                 ^

Error: The module '/home/testusr/prjaux/node_modules/modern-syslog/build/Release/core.node'
was compiled against a different Node.js version using
NODE_MODULE_VERSION 46. This version of Node.js requires
NODE_MODULE_VERSION 64. Please try re-compiling or re-installing
the module (for instance, using `npm rebuild` or `npm install`).
    at Object.Module._extensions..node (internal/modules/cjs/loader.js:805:18)
    at Module.load (internal/modules/cjs/loader.js:653:32)
    at tryModuleLoad (internal/modules/cjs/loader.js:593:12)
    at Function.Module._load (internal/modules/cjs/loader.js:585:3)
    at Module.require (internal/modules/cjs/loader.js:690:17)
    at require (internal/modules/cjs/helpers.js:25:18)
    at Object.<anonymous> (/home/testusr/prjaux/node_modules/modern-syslog/index.js:9:12)
    at Module._compile (internal/modules/cjs/loader.js:776:30)
    at Object.Module._extensions..js (internal/modules/cjs/loader.js:787:10)
    at Module.load (internal/modules/cjs/loader.js:653:32)
[nodemon] app crashed - waiting for file changes before starting...

메시지를 보면, NODE_MODULE_VERSION 46, NODE_MODULE_VERSION 64 차이라고 생각할 수 있으나... process.dlopen 측의 영향이 더 큰 것 같습니다. 어쨌든 이유는 정확히 알 수 없으나 sudo 권한으로 다음과 같이 실행해야 합니다.

$ sudo node app.js
TEST

혹시, sudo 권한 없이 syslog 출력을 할 수 있는 모듈을 알고 있다면 덧글 부탁드립니다. (C/C++에서 sudo가 필요 없었으니, node.js도 굳이 필요하진 않을 듯한데요. ^^)




참고로, 윈도우의 Ubuntu 스토어 앱에서는 /var/log/syslog 파일이 없습니다. 왜냐하면 서비스 자체가 기본적으로 실행되고 있지 않기 때문입니다. 그래서 미리 해당 서비스를 실행해 두어야 합니다.

$ service rsyslog status
 * rsyslogd is not running

$ sudo service rsyslog start
* Starting enhanced syslogd rsyslogd
[Ubuntu]
$ sudo tail -F /var/log/syslog

[CentOS 7]
$ sudo tail -F /var/log/messages




기타, syslog로 검색한 다른 패키지를 설치해봤더니,

Node-Syslog
; https://www.npmjs.com/package/node-syslog

이번엔 설치 단계에서 오류가 발생합니다.

$ npm install node-syslog

> node-syslog@1.2.0 install /home/testusr/prjaux/node_modules/node-syslog
> node-gyp rebuild

gyp WARN download NVM_NODEJS_ORG_MIRROR is deprecated and will be removed in node-gyp v4, please use NODEJS_ORG_MIRROR
gyp WARN download NVM_NODEJS_ORG_MIRROR is deprecated and will be removed in node-gyp v4, please use NODEJS_ORG_MIRROR
gyp WARN download NVM_NODEJS_ORG_MIRROR is deprecated and will be removed in node-gyp v4, please use NODEJS_ORG_MIRROR
make: Entering directory '/home/testusr/prjaux/node_modules/node-syslog/build'
  CXX(target) Release/obj.target/syslog/syslog.o
In file included from ../node-syslog.h:13:0,
                 from ../syslog.cc:1:
../compat.h:27:2: error: #error "Unsupported node.js version."
 #error "Unsupported node.js version."
  ^
../compat.h:62:53: error: ‘FunctionCallback’ has not been declared
                                                     FunctionCallback callback =
                                                     ^
...[생략]...

"Node-Syslog" 문서에 보면,

This module has been tested with:
node.js v0.8.16

0.8.16이라고 하는데, 엄청 옛날 버전인듯하고... 암튼 지원이 안 됩니다. 또 다른 것도 있지만 역시나 오류가 발생합니다.

$ sudo npm install syslog-node
npm WARN lifecycle unixlib@0.1.3~preinstall: cannot run in wd %s %s
 (wd=%s) unixlib@0.1.3 node-waf configure && node-waf build /home/kevin/prjaux/node_modules/.staging/unixlib-b6827233

> node-syslog@1.2.0 install /home/kevin/prjaux/node_modules/node-syslog
> node-gyp rebuild

make: Entering directory '/home/kevin/prjaux/node_modules/node-sysl
og/build'
  CXX(target) Release/obj.target/syslog/syslog.o
In file included from ../node-syslog.h:13:0,
                 from ../syslog.cc:1:
../compat.h:27:2: error: #error "Unsupported node.js version."
 #error "Unsupported node.js version."
  ^~~~~
../compat.h:62:53: error: ‘FunctionCallback’ has not been declared
                                                     FunctionCallback callback =
...[생략]...




[이 글에 대해서 여러분들과 의견을 공유하고 싶습니다. 틀리거나 미흡한 부분 또는 의문 사항이 있으시면 언제든 댓글 남겨주십시오.]





[최초 등록일: ]
[최종 수정일: 6/25/2019 ]

Creative Commons License
이 저작물은 크리에이티브 커먼즈 코리아 저작자표시-비영리-변경금지 2.0 대한민국 라이센스에 따라 이용하실 수 있습니다.
by SeongTae Jeong, mailto:techsharer@outlook.com

비밀번호

댓글 쓴 사람
 




1  2  3  4  [5]  6  7  8  9  10  11  12  13  14  15  ...
NoWriterDateCnt.TitleFile(s)
12287정성태8/5/2020223오류 유형: 636. C# - libdl.so를 DllImport로 연결 시 docker container 내에서 System.DllNotFoundException 예외 발생
12286정성태8/5/2020258개발 환경 구성: 501. .NET Core 용 container 이미지 만들 때 unzip이 필요한 경우
12285정성태8/4/2020374오류 유형: 635. 윈도우 10 업데이트 - 0xc1900209 [2]
12284정성태8/26/2020419디버깅 기술: 169. Hyper-V의 VM에 대한 메모리 덤프를 뜨는 방법
12283정성태8/3/2020269디버깅 기술: 168. windbg - 필터 드라이버 확인하는 확장 명령어(!fltkd)
12282정성태8/2/2020228디버깅 기술: 167. windbg 디버깅 사례: AppDomain 간의 static 변수 사용으로 인한 crash (2)
12281정성태8/2/2020420개발 환경 구성: 500. (PDB 연결이 없는) DLL의 소스 코드 디버깅을 dotPeek 도구로 해결하는 방법
12280정성태8/2/2020349오류 유형: 634. 오라클 (평생) 무료 클라우드 VM 생성 후 SSH 접속 시 키 오류 발생
12279정성태7/29/2020253개발 환경 구성: 499. 닷넷에서 접근해보는 InterSystems의 Cache 데이터베이스파일 다운로드1
12278정성태8/2/2020242VS.NET IDE: 149. ("Binary was not built with debug information" 상태로) 소스 코드 디버깅이 안되는 경우
12277정성태8/2/2020380개발 환경 구성: 498. DEVPATH 환경 변수의 사용 예 - .NET Reflector의 (PDB 연결이 없는) DLL의 소스 코드 디버깅
12276정성태7/23/2020379.NET Framework: 930. 개발자를 위한 닷넷 어셈블리 바인딩 - DEVPATH 환경 변수
12275정성태7/28/2020329개발 환경 구성: 497. 닷넷에서 접근해보는 InterSystems의 IRIS Data Platform 데이터베이스파일 다운로드1
12274정성태7/21/2020351개발 환경 구성: 496. Azure - Blob Storage Account의 Location 이전 방법파일 다운로드1
12273정성태7/20/2020450개발 환경 구성: 495. Azure - Location이 다른 웹/DB 서버의 경우 발생하는 성능 하락
12272정성태7/16/2020287.NET Framework: 929. (StrongName의 버전 구분이 필요 없는) .NET Core 어셈블리 바인딩 규칙파일 다운로드1
12271정성태7/16/2020289.NET Framework: 928. .NET Framework의 Strong-named 어셈블리 바인딩 (2) - 런타임에 바인딩 리디렉션파일 다운로드1
12270정성태7/16/2020358오류 유형: 633. SSL_CTX_use_certificate_file - error:140AB18F:SSL routines:SSL_CTX_use_certificate:ee key too small
12269정성태7/16/2020242오류 유형: 632. .NET Core 웹 응용 프로그램 - The process was terminated due to an unhandled exception.
12268정성태7/15/2020289오류 유형: 631. .NET Core 웹 응용 프로그램 오류 - HTTP Error 500.35 - ANCM Multiple In-Process Applications in same Process
12267정성태7/15/2020436.NET Framework: 927. C# - 윈도우 프로그램에서 Credential Manager를 이용한 보안 정보 저장파일 다운로드1
12266정성태7/14/2020368오류 유형: 630. 사용자 계정을 지정해 CreateService API로 서비스를 등록한 경우 "Error 1069: The service did not start due to a logon failure." 오류발생
12265정성태7/10/2020234오류 유형: 629. Visual Studio - 웹 애플리케이션 실행 시 "Unable to connect to web server 'IIS Express'." 오류 발생
12264정성태7/9/2020311오류 유형: 628. docker: Error response from daemon: Conflict. The container name "..." is already in use by container "...".
12261정성태9/26/2020680VS.NET IDE: 148. 윈도우 10에서 .NET Core 응용 프로그램을 리눅스 환경에서 실행하는 2가지 방법 - docker, WSL 2 [5]
12260정성태7/8/2020296.NET Framework: 926. C# - ETW를 이용한 ThreadPool 스레드 감시파일 다운로드1
1  2  3  4  [5]  6  7  8  9  10  11  12  13  14  15  ...