Microsoft MVP성태의 닷넷 이야기
글쓴 사람
홈페이지
첨부 파일
 

C# 6.0 이상의 문법을 컴파일 시 오류가 발생한다면?

지난번에도 이와 유사한 글을 남긴 적이 있는데요,

C# 6.0 이상의 소스 코드를 Visual Studio 설치 없이 명령행에서 컴파일하는 방법
; https://www.sysnet.pe.kr/2/0/11266

예를 들어 다음과 같이 빌드했을 때,

C:\temp\ConsoleApp1\ConsoleApp1> msbuild "ConsoleApp1.csproj"

Microsoft (R) Build Engine version 4.7.2053.0
[Microsoft .NET Framework, version 4.0.30319.42000]
Copyright (C) Microsoft Corporation. All rights reserved.

Build started 2019-05-10 오후 1:20:06.
Project "C:\temp\ConsoleApp1\ConsoleApp1\ConsoleApp1.csproj" on node 1 (default targets).
Project file contains ToolsVersion="15.0". This toolset may be unknown or missing, in which case you may be able to resolve this by installing the appropriate
 version of MSBuild, or the build may have been forced to a particular ToolsVersion for policy reasons. Treating the project as if it had ToolsVersion="4.0".
For more information, please see http://go.microsoft.com/fwlink/?LinkId=291333.
GenerateTargetFrameworkMonikerAttribute:
Skipping target "GenerateTargetFrameworkMonikerAttribute" because all output files are up-to-date with respect to the input files.
CoreCompile:
  C:\Windows\Microsoft.NET\Framework\v4.0.30319\Csc.exe /noconfig /nowarn:1701,1702 /nostdlib+ /platform:anycpu32bitpreferred /errorreport:prompt /warn:4 /def
  ine:DEBUG;TRACE /highentropyva+ /reference:"C:\Program Files (x86)\Reference Assemblies\Microsoft\Framework\.NETFramework\v4.6.1\Microsoft.CSharp.dll" /refe
  rence:"C:\Program Files (x86)\Reference Assemblies\Microsoft\Framework\.NETFramework\v4.6.1\mscorlib.dll" /reference:"C:\Program Files (x86)\Reference Assem
  blies\Microsoft\Framework\.NETFramework\v4.6.1\System.Core.dll" /reference:"C:\Program Files (x86)\Reference Assemblies\Microsoft\Framework\.NETFramework\v4
  .6.1\System.Data.DataSetExtensions.dll" /reference:"C:\Program Files (x86)\Reference Assemblies\Microsoft\Framework\.NETFramework\v4.6.1\System.Data.dll" /r
  eference:"C:\Program Files (x86)\Reference Assemblies\Microsoft\Framework\.NETFramework\v4.6.1\System.dll" /reference:"C:\Program Files (x86)\Reference Asse
  mblies\Microsoft\Framework\.NETFramework\v4.6.1\System.Net.Http.dll" /reference:"C:\Program Files (x86)\Reference Assemblies\Microsoft\Framework\.NETFramewo
  rk\v4.6.1\System.Xml.dll" /reference:"C:\Program Files (x86)\Reference Assemblies\Microsoft\Framework\.NETFramework\v4.6.1\System.Xml.Linq.dll" /debug+ /deb
  ug:full /filealign:512 /optimize- /out:obj\Debug\ConsoleApp1.exe /subsystemversion:6.00 /target:exe /utf8output Program.cs Properties\AssemblyInfo.cs "C:\Us
  ers\SeongTae Jeong\AppData\Local\Temp\.NETFramework,Version=v4.6.1.AssemblyAttributes.cs"
Program.cs(13,31): error CS1056: Unexpected character '$' [C:\temp\ConsoleApp1\ConsoleApp1\ConsoleApp1.csproj]
Done Building Project "C:\temp\ConsoleApp1\ConsoleApp1\ConsoleApp1.csproj" (default targets) -- FAILED.

Build FAILED.

"C:\temp\ConsoleApp1\ConsoleApp1\ConsoleApp1.csproj" (default target) (1) ->
(CoreCompile target) ->
  Program.cs(13,31): error CS1056: Unexpected character '$' [C:\temp\ConsoleApp1\ConsoleApp1\ConsoleApp1.csproj]

    0 Warning(s)
    1 Error(s)

Time Elapsed 00:00:00.29

C# 6.0에서 추가된 string interpolation 구문이 빌드되지 않는다면 사용된 csc.exe의 경로를 확인해야 합니다. 위의 내용을 보면 "C:\Windows\Microsoft.NET\Framework\v4.0.30319\Csc.exe"라고 되어 있는데 따라서 .NET Framework에 기본 설치된 C# 5.0 컴파일러가 사용되고 있는 것입니다.

현재 자신의 빌드 환경에서 어떤 경로의 csc.exe가 사용되고 있는지는 where을 실행해 보면 됩니다.

C:\temp\ConsoleApp1\ConsoleApp1> where csc.exe
C:\Windows\Microsoft.NET\Framework\v4.0.30319\csc.exe
C:\Program Files (x86)\Microsoft Visual Studio\2017\Enterprise\MSBuild\15.0\Bin\Roslyn\csc.exe

보는 바와 같이 C# 6.0 이상의 구문을 지원하는 Roslyn 컴파일러의 우선순위가 밀려 있는데 이를 (환경 변수의 잘못 설정된 PATH 등을 수정해) 바로잡아주면 정상적으로 프로젝트를 빌드할 수 있습니다.




[이 글에 대해서 여러분들과 의견을 공유하고 싶습니다. 틀리거나 미흡한 부분 또는 의문 사항이 있으시면 언제든 댓글 남겨주십시오.]





[최초 등록일: ]
[최종 수정일: 5/10/2019 ]

Creative Commons License
이 저작물은 크리에이티브 커먼즈 코리아 저작자표시-비영리-변경금지 2.0 대한민국 라이센스에 따라 이용하실 수 있습니다.
by SeongTae Jeong, mailto:techsharer@outlook.com

비밀번호

댓글 쓴 사람
 




1  2  3  4  5  [6]  7  8  9  10  11  12  13  14  15  ...
NoWriterDateCnt.TitleFile(s)
11913정성태5/24/2019589.NET Framework: 838. C# - 숫자형 타입의 bit(2진) 문자열, 16진수 문자열 구하는 방법파일 다운로드1
11912정성태5/23/2019505VS.NET IDE: 137. Visual Studio 2019 버전 16.1부터 리눅스 C/C++ 프로젝트에 추가된 WSL 지원
11911정성태5/23/2019498VS.NET IDE: 136. Visual Studio 2019 - 리눅스 C/C++ 프로젝트에 인텔리센스가 동작하지 않는 경우
11910정성태5/24/2019917Math: 50. C# - MathNet.Numerics의 Matrix(행렬) 연산파일 다운로드1
11909정성태5/25/2019868.NET Framework: 837. C# - PLplot 사용 예제 [1]파일 다운로드1
11908정성태5/22/2019563.NET Framework: 836. C# - Python range 함수 구현파일 다운로드1
11907정성태6/4/2019426오류 유형: 541. msbuild - MSB4024 The imported project file "...targets" could not be loaded
11906정성태5/21/2019440.NET Framework: 835. .NET Core/C# - 리눅스 syslog에 로그 남기는 방법
11905정성태5/21/2019505.NET Framework: 834. C# - 폴더 경로 문자열에서 "..", "." 표기를 고려한 최종 문자열을 얻는 방법 - 두 번째 이야기
11904정성태5/21/2019770.NET Framework: 833. C# - Open Hardware Monitor를 이용한 CPU 온도 정보파일 다운로드1
11903정성태5/21/2019612오류 유형: 540. .NET Core - System.PlatformNotSupportedException: The named version of this synchronization primitive is not supported on this platform.
11902정성태5/21/2019396오류 유형: 539. mstest 실행 시 "The directory name is invalid." 오류 발생
11901정성태5/21/2019625오류 유형: 538. msbuild 오류 - Could not find a part of the path '%LOCALAPPDATA%\Temp\2\.NETFramework,Version=v4.0.AssemblyAttributes.cs'
11900정성태5/18/2019561오류 유형: 537. "sfc /scannow" 실행 중 시스템이 부팅되는 현상
11899정성태5/17/2019794Linux: 9. Linux에서 윈도우의 OutputDebugString 대신 사용할 수 있는 syslog [1]
11898정성태5/20/2019655VC++: 130. C++ string의 c_str과 data 함수의 차이점 [3]
11897정성태5/16/20191038오류 유형: 536. Visual Studio - "Developer Pack"을 설치했는데도 "대상 프레임워크" 목록에 나오지 않는 경우
11896정성태5/15/2019682개발 환경 구성: 440. C#, C++ - double의 Infinity, NaN 표현 방식파일 다운로드1
11895정성태5/12/2019748.NET Framework: 832. ML.NET Model Builder - 회귀(Regression), 다중 분류(Multi-class classification) 예제파일 다운로드1
11894정성태5/12/2019921VS.NET IDE: 135. Visual Studio - ML.NET Model Builder 소개 [1]
11893정성태5/10/2019682오류 유형: 535. C# 6.0 이상의 문법을 컴파일 시 오류가 발생한다면?
11892정성태5/10/2019559웹: 38. HTTP Cookie의 expires 시간 형식(RFC7231)
11891정성태5/9/2019675.NET Framework: 831. (번역글) .NET Internals Cookbook Part 12 - Memory structure, attributes, handles
11890정성태5/8/2019554개발 환경 구성: 439. "Visual Studio Enterprise is required to execute the test." 메시지와 관련된 코드 기록
11889정성태5/8/2019538개발 환경 구성: 438. mstest, QTAgent의 로그 파일 설정 방법
11888정성태5/8/2019740.NET Framework: 830. C# - 비동기 호출을 취소하는 CancellationToken의 간단한 예제 코드파일 다운로드1
1  2  3  4  5  [6]  7  8  9  10  11  12  13  14  15  ...