Microsoft MVP성태의 닷넷 이야기
글쓴 사람
홈페이지
첨부 파일
 

CoreCLR Profiler 예제 프로젝트 빌드 시 컴파일 오류 유형

아래의 예제로,

마이크로소프트의 CoreCLR 프로파일러 리눅스 예제를 Visual Studio F5 원격 디버깅하는 방법
; https://www.sysnet.pe.kr/2/0/11856

프로젝트를 하다보면 이상한 오류를 많이 만나게 됩니다. ^^; 일례로, 다음과 같은 프로그램은 멀쩡히 잘 컴파일이 되다가 C++14 표준으로 다시 컴파일하면,

#include "./bits/parse_numbers.h"

int main()
{
    return 0;
}

이런 오류가 발생합니다.

1>/usr/bin/../lib/gcc/x86_64-linux-gnu/8/../../../../include/c++/8/./bits/parse_numbers.h(51,33): error : unknown template name 'integral_constant'
1>/usr/bin/../lib/gcc/x86_64-linux-gnu/8/../../../../include/c++/8/./bits/parse_numbers.h(53,23): error : unknown type name 'true_type'
1>/usr/bin/../lib/gcc/x86_64-linux-gnu/8/../../../../include/c++/8/./bits/parse_numbers.h(53,23): error :       using __valid = true_type;
1>/usr/bin/../lib/gcc/x86_64-linux-gnu/8/../../../../include/c++/8/./bits/parse_numbers.h(53,23): error :                       ^

첫 번째 "unknown template name 'integral_constant'" 소스 코드는 이렇습니다.

  template<unsigned _Base>
    struct _Digit<_Base, '0'> : integral_constant<unsigned, 0>
    {
      using __valid = true_type;
    };

당연합니다. 말 그대로 integral_constant가 정의되어 있지 않으므로 발생한 것인데, 이것은 type_traits 헤더에 있으므로 다음과 같이 추가해 주면

#include <type_traits>
#include "./bits/parse_numbers.h"

정상적으로 빌드가 됩니다. 물론, 저런 식으로 parse_numbers.h 헤더 파일을 직접 include하는 경우보다는 다른 헤더 파일 내부에 중첩되어 포함되는 것이 대부분이기 때문에 초보자의 경우에는 어디가 문제인지 모르고 헤맬 수가 있습니다. 애당초 parse_numbers.h 헤더 파일 측에서 의존성을 갖고 있는 type_traits를 포함했다면 이런 문제가 없었을 것입니다.




리눅스의 불친절한 헤더 파일 의존성 문제 외에도, 더욱 심각한 것은 CoreCLR이 다중 플랫폼을 목적으로 구성된 소스 코드라서 "cor" 폴더 하위의 헤더 파일 중에 윈도우의 것을 가져오는 것이 많고 그걸로 인해 충돌하는 경우까지 겹칩니다.

예를 들어, 위의 예제에서 다시 다음과 같이 추가하면,

#include <sal.h>
#include <type_traits>
#include "./bits/parse_numbers.h"

이번에도 희한한(?) 오류가 발생합니다.

1>/usr/bin/../lib/gcc/x86_64-linux-gnu/8/../../../../include/c++/8/./bits/parse_numbers.h(53,21): error : expected unqualified-id
1>/usr/bin/../lib/gcc/x86_64-linux-gnu/8/../../../../include/c++/8/./bits/parse_numbers.h(53,21): error :       using __valid = true_type;
1>/usr/bin/../lib/gcc/x86_64-linux-gnu/8/../../../../include/c++/8/./bits/parse_numbers.h(53,21): error :                     ^

1>/usr/bin/../lib/gcc/x86_64-linux-gnu/8/../../../../include/c++/8/./bits/parse_numbers.h(153,21): error : expected unqualified-id
1>/usr/bin/../lib/gcc/x86_64-linux-gnu/8/../../../../include/c++/8/./bits/parse_numbers.h(153,21): error :       using __valid = false_type;
1>/usr/bin/../lib/gcc/x86_64-linux-gnu/8/../../../../include/c++/8/./bits/parse_numbers.h(153,21): error :                     ^

1>/usr/bin/../lib/gcc/x86_64-linux-gnu/8/../../../../include/c++/8/./bits/parse_numbers.h(165,66): error : expected an identifier or template-id after '::'
1>/usr/bin/../lib/gcc/x86_64-linux-gnu/8/../../../../include/c++/8/./bits/parse_numbers.h(167,36): error : use of undeclared identifier '__valid_digit'

문제가 되는 것은 "using __valid = true_type;" 코드인데요, 왜냐하면 sal.h 헤더 파일에 이런 매크로 정의가 포함되어 있기 때문입니다.

#define __valid

따라서 "using = true_type;"과 같은 코드가 되었으므로 오류가 발생하는데, 문제는 sal.h 파일이 "specstrings.h"에 기본 포함되어 있고, 다시 그 헤더 파일은 "cor/src/inc/contract.h", "cor/src/inc/stdmacros.h", "cor/src/pal/inc/rt/palrt.h" 등의 헤더 파일에 추가되어 있다는 점입니다.

이렇게 중첩된 헤더 파일들 속에서 문제가 발생하는 것이므로 역시나 초보자의 경우라면 해결이 매우 힘들 수 있습니다. 어쨌든 위와 같은 상황이라면 일부러 parse_numbers.h 헤더 파일을 최우선으로 포함해 처리하는 식으로 해결해야 합니다.

#include "Test1.h"

#include <type_traits>
#include "./bits/parse_numbers.h"

#include <sal.h>

암튼... 초기 프로젝트 구성을 C++11로 하고 나중에 C++17로 바꾸면서 이런 헤더 파일 정리해 주느라 ^^ 고생 좀 했습니다.




[이 글에 대해서 여러분들과 의견을 공유하고 싶습니다. 틀리거나 미흡한 부분 또는 의문 사항이 있으시면 언제든 댓글 남겨주십시오.]





[최초 등록일: ]
[최종 수정일: 6/18/2019 ]

Creative Commons License
이 저작물은 크리에이티브 커먼즈 코리아 저작자표시-비영리-변경금지 2.0 대한민국 라이센스에 따라 이용하실 수 있습니다.
by SeongTae Jeong, mailto:techsharer@outlook.com

비밀번호

댓글 쓴 사람
 




1  2  3  4  5  6  7  8  [9]  10  11  12  13  14  15  ...
NoWriterDateCnt.TitleFile(s)
12064정성태11/25/20191061오류 유형: 580. HTTP Error 500.0/500.33 - ANCM In-Process Handler Load Failure
12063정성태11/21/2019784디버깅 기술: 134. windbg - RtlReportCriticalFailure로부터 parameters 정보 찾는 방법
12062정성태12/20/2019648디버깅 기술: 133. windbg - CoTaskMemFree/FreeCoTaskMem에서 발생한 덤프 분석 사례 - 두 번째 이야기
12061정성태11/20/2019733Windows: 165. CoTaskMemAlloc/CoTaskMemFree과 윈도우 Heap의 관계
12060정성태11/21/2019809디버깅 기술: 132. windbg/Visual Studio - HeapFree x64의 동작 분석
12059정성태11/20/2019745디버깅 기술: 131. windbg/Visual Studio - HeapFree x86의 동작 분석
12058정성태11/19/2019721디버깅 기술: 130. windbg - CoTaskMemFree/FreeCoTaskMem에서 발생한 덤프 분석 사례
12057정성태11/18/2019507오류 유형: 579. Visual Studio - Memory 창에서 유효한 주소 영역임에도 "Unable to evaluate the expression." 오류 출력
12056정성태11/18/2019962개발 환경 구성: 464. "Microsoft Visual Studio Installer Projects" 프로젝트로 EXE 서명 및 MSI 파일 서명 방법파일 다운로드1
12055정성태11/17/2019519개발 환경 구성: 463. Visual Studio의 Ctrl + Alt + M, 1 (Memory 1) 등의 단축키가 동작하지 않는 경우
12054정성태11/15/2019938.NET Framework: 869. C# - 일부러 GC Heap을 깨뜨려 GC 수행 시 비정상 종료시키는 예제
12053정성태11/15/2019582Windows: 164. 윈도우 10 - 명령행 창(cmd.exe) 속성에 (DotumChe, GulimChe, GungsuhChe 등의) 한글 폰트가 없는 경우
12052정성태11/15/2019516오류 유형: 578. Azure - 일정(schedule)에 등록한 runbook이 1년 후 실행이 안 되는 문제(Reason - The key used is expired.)
12051정성태12/2/20191230개발 환경 구성: 462. 시작하자마자 비정상 종료하는 프로세스의 메모리 덤프 - procdump [1]
12050정성태11/14/2019764Windows: 163. AcLayers의 API 후킹과 FaultTolerantHeap
12049정성태11/13/2019568.NET Framework: 868. (닷넷 프로세스를 대상으로) 디버거 방식이 아닌 CLR Profiler를 이용해 procdump.exe 기능 구현
12048정성태11/12/2019792Windows: 163. GUID 이름의 볼륨에 해당하는 파티션을 찾는 방법
12047정성태11/12/20191285Windows: 163. 안전하게 eject시킨 USB 장치를 물리적인 재연결 없이 다시 인식시키는 방법
12046정성태11/9/2019704오류 유형: 577. windbg - The call to LoadLibrary(...\sos.dll) failed, Win32 error 0n193
12045정성태10/27/2019570오류 유형: 576. mstest.exe 실행 시 "Visual Studio Enterprise is required to execute the test." 오류 - 두 번째 이야기
12044정성태10/27/2019720오류 유형: 575. mstest.exe - System.Resources.MissingSatelliteAssemblyException: The satellite assembly named "Microsoft.VisualStudio.ProductKeyDialog.resources.dll, ..."
12043정성태10/27/2019724오류 유형: 574. Windows 10 설치 시 오류 - 0xC1900101 - 0x4001E
12042정성태10/26/2019662오류 유형: 573. OneDrive 하위에 위치한 Documents, Desktop 폴더에 대한 권한 변경 시 "Unable to display current owner"
12041정성태10/23/2019516오류 유형: 572. mstest.exe - The load test results database could not be opened.
12040정성태10/23/2019891오류 유형: 571. Unhandled Exception: System.Net.Mail.SmtpException: Transaction failed. The server response was: 5.2.0 STOREDRV.Submission.Exception:SendAsDeniedException.MapiExceptionSendAsDenied
12039정성태10/22/2019665스크립트: 16. cmd.exe의 for 문에서는 ERRORLEVEL이 설정되지 않는 문제
1  2  3  4  5  6  7  8  [9]  10  11  12  13  14  15  ...