Microsoft MVP성태의 닷넷 이야기
글쓴 사람
홈페이지
첨부 파일
 

C# 6.0 이상의 문법을 컴파일 시 오류가 발생한다면?

지난번에도 이와 유사한 글을 남긴 적이 있는데요,

C# 6.0 이상의 소스 코드를 Visual Studio 설치 없이 명령행에서 컴파일하는 방법
; https://www.sysnet.pe.kr/2/0/11266

예를 들어 다음과 같이 빌드했을 때,

C:\temp\ConsoleApp1\ConsoleApp1> msbuild "ConsoleApp1.csproj"

Microsoft (R) Build Engine version 4.7.2053.0
[Microsoft .NET Framework, version 4.0.30319.42000]
Copyright (C) Microsoft Corporation. All rights reserved.

Build started 2019-05-10 오후 1:20:06.
Project "C:\temp\ConsoleApp1\ConsoleApp1\ConsoleApp1.csproj" on node 1 (default targets).
Project file contains ToolsVersion="15.0". This toolset may be unknown or missing, in which case you may be able to resolve this by installing the appropriate
 version of MSBuild, or the build may have been forced to a particular ToolsVersion for policy reasons. Treating the project as if it had ToolsVersion="4.0".
For more information, please see http://go.microsoft.com/fwlink/?LinkId=291333.
GenerateTargetFrameworkMonikerAttribute:
Skipping target "GenerateTargetFrameworkMonikerAttribute" because all output files are up-to-date with respect to the input files.
CoreCompile:
  C:\Windows\Microsoft.NET\Framework\v4.0.30319\Csc.exe /noconfig /nowarn:1701,1702 /nostdlib+ /platform:anycpu32bitpreferred /errorreport:prompt /warn:4 /def
  ine:DEBUG;TRACE /highentropyva+ /reference:"C:\Program Files (x86)\Reference Assemblies\Microsoft\Framework\.NETFramework\v4.6.1\Microsoft.CSharp.dll" /refe
  rence:"C:\Program Files (x86)\Reference Assemblies\Microsoft\Framework\.NETFramework\v4.6.1\mscorlib.dll" /reference:"C:\Program Files (x86)\Reference Assem
  blies\Microsoft\Framework\.NETFramework\v4.6.1\System.Core.dll" /reference:"C:\Program Files (x86)\Reference Assemblies\Microsoft\Framework\.NETFramework\v4
  .6.1\System.Data.DataSetExtensions.dll" /reference:"C:\Program Files (x86)\Reference Assemblies\Microsoft\Framework\.NETFramework\v4.6.1\System.Data.dll" /r
  eference:"C:\Program Files (x86)\Reference Assemblies\Microsoft\Framework\.NETFramework\v4.6.1\System.dll" /reference:"C:\Program Files (x86)\Reference Asse
  mblies\Microsoft\Framework\.NETFramework\v4.6.1\System.Net.Http.dll" /reference:"C:\Program Files (x86)\Reference Assemblies\Microsoft\Framework\.NETFramewo
  rk\v4.6.1\System.Xml.dll" /reference:"C:\Program Files (x86)\Reference Assemblies\Microsoft\Framework\.NETFramework\v4.6.1\System.Xml.Linq.dll" /debug+ /deb
  ug:full /filealign:512 /optimize- /out:obj\Debug\ConsoleApp1.exe /subsystemversion:6.00 /target:exe /utf8output Program.cs Properties\AssemblyInfo.cs "C:\Us
  ers\SeongTae Jeong\AppData\Local\Temp\.NETFramework,Version=v4.6.1.AssemblyAttributes.cs"
Program.cs(13,31): error CS1056: Unexpected character '$' [C:\temp\ConsoleApp1\ConsoleApp1\ConsoleApp1.csproj]
Done Building Project "C:\temp\ConsoleApp1\ConsoleApp1\ConsoleApp1.csproj" (default targets) -- FAILED.

Build FAILED.

"C:\temp\ConsoleApp1\ConsoleApp1\ConsoleApp1.csproj" (default target) (1) ->
(CoreCompile target) ->
  Program.cs(13,31): error CS1056: Unexpected character '$' [C:\temp\ConsoleApp1\ConsoleApp1\ConsoleApp1.csproj]

    0 Warning(s)
    1 Error(s)

Time Elapsed 00:00:00.29

C# 6.0에서 추가된 string interpolation 구문이 빌드되지 않는다면 사용된 csc.exe의 경로를 확인해야 합니다. 위의 내용을 보면 "C:\Windows\Microsoft.NET\Framework\v4.0.30319\Csc.exe"라고 되어 있는데 따라서 .NET Framework에 기본 설치된 C# 5.0 컴파일러가 사용되고 있는 것입니다.

현재 자신의 빌드 환경에서 어떤 경로의 csc.exe가 사용되고 있는지는 where을 실행해 보면 됩니다.

C:\temp\ConsoleApp1\ConsoleApp1> where csc.exe
C:\Windows\Microsoft.NET\Framework\v4.0.30319\csc.exe
C:\Program Files (x86)\Microsoft Visual Studio\2017\Enterprise\MSBuild\15.0\Bin\Roslyn\csc.exe

보는 바와 같이 C# 6.0 이상의 구문을 지원하는 Roslyn 컴파일러의 우선순위가 밀려 있는데 이를 (환경 변수의 잘못 설정된 PATH 등을 수정해) 바로잡아주면 정상적으로 프로젝트를 빌드할 수 있습니다.




[이 글에 대해서 여러분들과 의견을 공유하고 싶습니다. 틀리거나 미흡한 부분 또는 의문 사항이 있으시면 언제든 댓글 남겨주십시오.]





[최초 등록일: ]
[최종 수정일: 5/10/2019 ]

Creative Commons License
이 저작물은 크리에이티브 커먼즈 코리아 저작자표시-비영리-변경금지 2.0 대한민국 라이센스에 따라 이용하실 수 있습니다.
by SeongTae Jeong, mailto:techsharer@outlook.com

비밀번호

댓글 쓴 사람
 




1  2  3  4  5  6  7  8  9  [10]  11  12  13  14  15  ...
NoWriterDateCnt.TitleFile(s)
11994정성태10/22/20191340개발 환경 구성: 454. Azure 가상 머신(VM)에서 SMTP 메일 전송하는 방법파일 다운로드1
11993정성태7/22/2019825오류 유형: 561. Dism.exe 수행 시 "Error: 2 - The system cannot find the file specified." 오류 발생
11992정성태7/22/2019952오류 유형: 560. 서비스 관리자 실행 시 "Windows was unable to open service control manager database on [...]. Error 5: Access is denied." 오류 발생
11991정성태7/18/2019687디버깅 기술: 128. windbg - x64 환경에서 닷넷 예외가 발생한 경우 인자를 확인할 수 없었던 사례
11990정성태3/16/20201399오류 유형: 559. Settings / Update & Security 화면 진입 시 프로그램 종료
11989정성태7/18/2019666Windows: 162. Windows Server 2019 빌드 17763부터 Alt + F4 입력시 곧바로 로그아웃하는 현상
11988정성태7/18/20191203개발 환경 구성: 453. 마이크로소프트가 지정한 모든 Root 인증서를 설치하는 방법
11987정성태7/17/20192740오류 유형: 558. 윈도우 - KMODE_EXCEPTION_NOT_HANDLED 블루스크린(BSOD) 문제
11986정성태7/18/2019781오류 유형: 557. 드라이브 문자를 할당하지 않은 파티션을 탐색기에서 드라이브 문자와 함께 보여주는 문제
11985정성태7/17/2019783개발 환경 구성: 452. msbuild - csproj에 환경 변수 조건 사용
11984정성태7/9/20191304개발 환경 구성: 451. Microsoft Edge (Chromium)을 대상으로 한 Selenium WebDriver 사용법
11983정성태7/8/2019796오류 유형: 556. nodemon - 'mocha' is not recognized as an internal or external command, operable program or batch file.
11982정성태7/8/2019828오류 유형: 555. Visual Studio 빌드 오류 - result: unexpected exception occured (-1002 - 0xfffffc16)
11981정성태7/7/20191034Math: 64. C# - 3층 구조의 신경망(분류)파일 다운로드1
11980정성태7/7/20193855개발 환경 구성: 450. Visual Studio Code의 Java 확장을 이용한 간단한 프로젝트 구축파일 다운로드1
11979정성태7/8/20191168개발 환경 구성: 449. TFS에서 gitlab/github등의 git 서버로 마이그레이션하는 방법
11978정성태7/6/20191137Windows: 161. 계정 정보가 동일하지 않은 PC 간의 인증을 수행하는 방법 [1]
11977정성태7/6/20191593오류 유형: 554. git push - error: RPC failed; HTTP 413 curl 22 The requested URL returned error: 413 Request Entity Too Large
11976정성태7/4/20191039오류 유형: 553. (잘못 인증 한 후) 원격 git repo 재인증 시 "remote: HTTP Basic: Access denied" 오류 발생
11975정성태7/4/20192468개발 환경 구성: 448. Visual Studio Code에서 콘솔 응용 프로그램 개발 시 "입력"받는 방법
11974정성태7/4/20191568Linux: 22. "Visual Studio Code + Remote Development"로 윈도우 환경에서 리눅스(CentOS 7) C/C++ 개발
11973정성태7/4/20191106Linux: 21. 리눅스에서 공유 라이브러리가 로드되지 않는다면?
11972정성태7/3/20191221.NET Framework: 847. JAVA와 .NET 간의 AES 암호화 연동파일 다운로드1
11971정성태7/3/20191173개발 환경 구성: 447. Visual Studio Code에서 OpenCvSharp 개발 환경 구성
11970정성태7/2/20191060오류 유형: 552. 웹 브라우저에서 파일 다운로드 후 "Running security scan"이 끝나지 않는 문제
11969정성태7/7/20191006Math: 63. C# - 3층 구조의 신경망파일 다운로드1
1  2  3  4  5  6  7  8  9  [10]  11  12  13  14  15  ...