Microsoft MVP성태의 닷넷 이야기
글쓴 사람
정성태 (techsharer at outlook.com)
홈페이지
첨부 파일
 

.NET Core 2.2 빌드 - error MSB4018: The "RazorTagHelper" task failed unexpectedly.

이상하군요, .NET Core 2.0/2.1 프로젝트는 괜찮은데 유독 2.2 프로젝트에서만 빌드 오류가 발생합니다.

Rebuild started...
1>------ Rebuild All started: Project: CoreCoreWin2, Configuration: Debug Any CPU ------
1>C:\Program Files\dotnet\sdk\5.0.100\Sdks\Microsoft.NET.Sdk\targets\Microsoft.NET.EolTargetFrameworks.targets(28,5): warning NETSDK1138: The target framework 'netcoreapp2.2' is out of support and will not receive security updates in the future. Please refer to https://aka.ms/dotnet-core-support for more information about the support policy.
1>C:\temp\AzureWebApps\AzureWebTest\CoreCoreWin2\Pages\Index.cshtml.cs(142,36,142,49): warning CS1998: This async method lacks 'await' operators and will run synchronously. Consider using the 'await' operator to await non-blocking API calls, or 'await Task.Run(...)' to do CPU-bound work on a background thread.
1>F:\nuget_root\microsoft.aspnetcore.razor.design\2.2.0\build\netstandard2.0\Microsoft.AspNetCore.Razor.Design.CodeGeneration.targets(79,5): error MSB4018: The "RazorTagHelper" task failed unexpectedly.
1>F:\nuget_root\microsoft.aspnetcore.razor.design\2.2.0\build\netstandard2.0\Microsoft.AspNetCore.Razor.Design.CodeGeneration.targets(79,5): error MSB4018: System.InvalidOperationException: DOTNET_HOST_PATH is not set
1>F:\nuget_root\microsoft.aspnetcore.razor.design\2.2.0\build\netstandard2.0\Microsoft.AspNetCore.Razor.Design.CodeGeneration.targets(79,5): error MSB4018:    at Microsoft.AspNetCore.Razor.Tasks.DotNetToolTask.get_DotNetPath()
1>F:\nuget_root\microsoft.aspnetcore.razor.design\2.2.0\build\netstandard2.0\Microsoft.AspNetCore.Razor.Design.CodeGeneration.targets(79,5): error MSB4018:    at Microsoft.AspNetCore.Razor.Tasks.DotNetToolTask.GenerateFullPathToTool()
1>F:\nuget_root\microsoft.aspnetcore.razor.design\2.2.0\build\netstandard2.0\Microsoft.AspNetCore.Razor.Design.CodeGeneration.targets(79,5): error MSB4018:    at Microsoft.Build.Utilities.ToolTask.ComputePathToTool()
1>F:\nuget_root\microsoft.aspnetcore.razor.design\2.2.0\build\netstandard2.0\Microsoft.AspNetCore.Razor.Design.CodeGeneration.targets(79,5): error MSB4018:    at Microsoft.Build.Utilities.ToolTask.Execute()
1>F:\nuget_root\microsoft.aspnetcore.razor.design\2.2.0\build\netstandard2.0\Microsoft.AspNetCore.Razor.Design.CodeGeneration.targets(79,5): error MSB4018:    at Microsoft.AspNetCore.Razor.Tasks.DotNetToolTask.Execute()
1>F:\nuget_root\microsoft.aspnetcore.razor.design\2.2.0\build\netstandard2.0\Microsoft.AspNetCore.Razor.Design.CodeGeneration.targets(79,5): error MSB4018:    at Microsoft.Build.BackEnd.TaskExecutionHost.Microsoft.Build.BackEnd.ITaskExecutionHost.Execute()
1>F:\nuget_root\microsoft.aspnetcore.razor.design\2.2.0\build\netstandard2.0\Microsoft.AspNetCore.Razor.Design.CodeGeneration.targets(79,5): error MSB4018:    at Microsoft.Build.BackEnd.TaskBuilder.<ExecuteInstantiatedTask>d__26.MoveNext()
1>Done building project "CoreCoreWin2.csproj" -- FAILED.
========== Rebuild All: 0 succeeded, 1 failed, 0 skipped ==========

DOTNET_HOST_PATH가 설정되어 있지 않다고 하는데, 실제로 검색해 보면,

Build is failing for Microsoft.NET.Sdk.Razor project
; https://developercommunity2.visualstudio.com/t/Build-is-failing-for-MicrosoftNETSdkR/1251808?preview=true

해결책으로 환경 변수 설정이 필요하다고 합니다.

환경 변수 이름: DOTNET_HOST_PATH
환경 변숫값: dotnet

path라는 이름에서 dotnet.exe가 있는 경로를 지정해야 할 것 같지만,

%ProgramFiles%\dotnet\dotnet.exe

환경 변수 PATH에 경로가 잡혀 있는 경우 dotnet만 있어도 잘 동작합니다.




[이 글에 대해서 여러분들과 의견을 공유하고 싶습니다. 틀리거나 미흡한 부분 또는 의문 사항이 있으시면 언제든 댓글 남겨주십시오.]







[최초 등록일: ]
[최종 수정일: 12/2/2024]

Creative Commons License
이 저작물은 크리에이티브 커먼즈 코리아 저작자표시-비영리-변경금지 2.0 대한민국 라이센스에 따라 이용하실 수 있습니다.
by SeongTae Jeong, mailto:techsharer at outlook.com

비밀번호

댓글 작성자
 




... 151  152  153  154  155  156  157  158  159  160  161  162  [163]  164  165  ...
NoWriterDateCnt.TitleFile(s)
972정성태1/7/201124177개발 환경 구성: 95. SQL Server 2008 R2 이하 버전 정보 확인
971정성태1/5/201133759.NET Framework: 199. .NET 코드 - Named Pipe 닷넷 서버와 VC++ 클라이언트 제작 [2]파일 다운로드1
970정성태1/4/201134281.NET Framework: 198. 윈도우 응용 프로그램에 Facebook 로그인 연동 [1]파일 다운로드1
969정성태12/31/201040365VC++: 45. Winsock 2 Layered Service Provider - Visual Studio 2010용 프로젝트 [1]파일 다운로드1
968정성태12/30/201026646개발 환경 구성: 94. 개발자가 선택할 수 있는 윈도우에서의 네트워크 프로그래밍 기술 [2]
967정성태12/27/201028420.NET Framework: 197. .NET 코드 - 단일 Process 실행파일 다운로드1
966정성태12/26/201026370.NET Framework: 196. .NET 코드 - 창 흔드는 효과파일 다운로드1
965정성태12/25/201027883개발 환경 구성: 93. MSBuild를 이용한 닷넷 응용프로그램의 다중 어셈블리 출력 빌드파일 다운로드1
964정성태12/21/2010143034개발 환경 구성: 92. 윈도우 서버 환경에서, 최대 생성 가능한 소켓(socket) 연결 수는 얼마일까? [14]
963정성태12/13/201027902개발 환경 구성: 91. MSBuild를 이용한 닷넷 응용프로그램의 플랫폼(x86/x64)별 빌드 [2]파일 다운로드1
962정성태12/10/201022765오류 유형: 110. GAC 등록 - Failure adding assembly to the cache: Invalid file or assembly name.
961정성태12/10/201099808개발 환경 구성: 90. 닷넷에서 접근해보는 PostgreSQL DB [5]
960정성태12/8/201045122.NET Framework: 195. .NET에서 코어(Core) 관련 CPU 정보 알아내는 방법파일 다운로드1
959정성태12/8/201031948.NET Framework: 194. Facebook 연동 - API Error Description: Invalid OAuth 2.0 Access Token
958정성태12/7/201028945개발 환경 구성: 89. 배치(batch) 파일에서 또 다른 배치 파일을 동기 방식으로 실행 및 반환값 얻기 [2]
957정성태12/6/201031705디버깅 기술: 31. Windbg - Visual Studio 디버그 상태에서 종료해 버리는 응용 프로그램 [3]
953정성태11/28/201036915.NET Framework: 193. 페이스북(Facebook) 계정으로 로그인하는 C# 웹 사이트 제작 [5]
952정성태11/25/201025353.NET Framework: 192. GC의 부하는 상대적인 것! [4]
950정성태11/18/201076719.NET Framework: 191. ClickOnce - 관리자 권한 상승하는 방법 [17]파일 다운로드2
954정성태11/29/201048702    답변글 .NET Framework: 191.1. [답변] 클릭원스 - 요청한 작업을 수행하려면 권한 상승이 필요합니다. (Exception from HRESULT: 0x800702E4) [2]
949정성태11/16/201027254오류 유형: 109. System.ServiceModel.Security.SecurityNegotiationException
948정성태11/16/201036062.NET Framework: 190. 트위터 계정으로 로그인하는 C# 웹 사이트 제작 [7]파일 다운로드1
947정성태11/14/201041694.NET Framework: 189. Mono Cecil로 만들어 보는 .NET Decompiler [1]파일 다운로드1
946정성태11/11/201041552.NET Framework: 188. .NET 64비트 응용 프로그램에서 왜 (2GB) OutOfMemoryException 예외가 발생할까? [1]파일 다운로드1
945정성태11/11/201025041VC++: 44. C++/CLI 컴파일 오류 - error C4368: mixed types are not supported
944정성태11/11/201031574VC++: 43. C++/CLI 컴파일 오류 - error C2872: 'IServiceProvider' : ambiguous symbol could be ...
... 151  152  153  154  155  156  157  158  159  160  161  162  [163]  164  165  ...