Microsoft MVP성태의 닷넷 이야기
글쓴 사람
정성태 (techsharer at outlook.com)
홈페이지
첨부 파일
 

.NET Core 용 container 이미지 만들 때 unzip이 필요한 경우

닷넷 용 컨테이너 이미지를 만드는 경우 대개 마이크로소프트의 권장에 따라,

Visual Studio - ASP.NET Core Web Application의 "Enable Docker Support" 옵션으로 달라지는 점
; https://www.sysnet.pe.kr/2/0/12171

mcr.microsoft.com/dotnet/core/aspnet:3.1-buster-slim이나, mcr.microsoft.com/dotnet/core/sdk:3.1-buster를 사용하게 될 것입니다. 이런 이미지들은 마이크로소프트가 경량화시킨 것이기 때문에 - 특히 slim 버전의 경우 - Dockerfile 내의 명령어 수행에 'unzip' 같은 것을 포함하면 다음과 같은 오류가 발생합니다.

 Step 15/20 : RUN unzip test.zip
  ---> Running in 0e9904a5c1e0
 /bin/sh: 1: unzip: not found
 The command '/bin/sh -c unzip test.zip' returned a non-zero code: 127
 ERROR: Job failed: exit code 127

검색해 보면,

Debug .NET Core with docker containers
; https://github.com/microsoft/generator-docker/issues/130

아예 unzip을 이미지 내에 설치하도록 하는 방법이 있습니다. ^^

 RUN apt-get update && apt-get install -y --no-install-recommends unzip && rm -rf /var/lib/apt/lists/*

최종 이미지를 이렇게 만드는 것은 바람직하지 않으니, "Visual Studio - ASP.NET Core Web Application의 "Enable Docker Support" 옵션으로 달라지는 점" 글에서도 다뤘던 pubilsh 단계에서 처리하는 것이 좋을 텐데요,

...[생략]...

FROM build AS publish
RUN dotnet publish "ConsoleApp1.csproj" -c Release -o /app/publish
RUN apt-get update && apt-get install -y --no-install-recommends unzip && rm -rf /var/lib/apt/lists/*

...[생략]...

따라서 프로젝트에 "test.zip" 파일이 있어 이를 처리하려고 한다면 다음과 같은 식으로 압축 해제를 할 수 있습니다.

...[생략]...

FROM build AS publish
RUN dotnet publish "ConsoleApp2.csproj" -c Release -o /app/publish
RUN apt-get update && apt-get install -y --no-install-recommends unzip && rm -rf /var/lib/apt/lists/*

WORKDIR /extracted
COPY ./ConsoleApp1/test.zip .
RUN unzip test.zip

FROM base AS final
WORKDIR /app
COPY --from=publish /app/publish .
COPY --from=publish /extracted ./extracted/
ENTRYPOINT ["dotnet", "ConsoleApp2.dll"]




그런데, apt-get... 명령어가 "mcr.microsoft.com/dotnet/core/sdk:2.1-stretch" 이미지를 대상으로는 수행이 되지만, .NET Core 3.1 용 이미지인 "mcr.microsoft.com/dotnet/core/sdk:3.1-buster"에서는 현재 다음과 같은 식의 오류가 발생합니다.

1>Step 12/18 : RUN apt-get update && apt-get install -y --no-install-recommends unzip && rm -rf /var/lib/apt/lists/*
1> ---> Running in cd78a969cc77
1>Get:1 http://deb.debian.org/debian buster InRelease [122 kB]
1>Get:2 http://security.debian.org/debian-security buster/updates InRelease [65.4 kB]
1>Get:3 http://deb.debian.org/debian buster-updates InRelease [49.3 kB]
1>Get:4 http://deb.debian.org/debian buster/main amd64 Packages [7907 kB]
1>Reading package lists...
1>E: Release file for http://security.debian.org/debian-security/dists/buster/updates/InRelease is not valid yet (invalid for another 10d 9h 28min 51s). Updates for this repository will not be applied.
1>E: Release file for http://deb.debian.org/debian/dists/buster-updates/InRelease is not valid yet (invalid for another 10d 0h 5min 14s). Updates for this repository will not be applied.
1>Removing intermediate container cd78a969cc77
1>The command '/bin/sh -c apt-get update && apt-get install -y --no-install-recommends unzip && rm -rf /var/lib/apt/lists/*' returned a non-zero code: 100
1>f:\temp\consoleapp1\dockerfile : error CTC1014: Docker command failed with exit code 100.
1>f:\temp\consoleapp1\dockerfile : error CTC1014: The command '/bin/sh -c apt-get update && apt-get install -y --no-install-recommends unzip && rm -rf /var/lib/apt/lists/*' returned a non-zero code: 100
1>Done building project "ConsoleApp1.csproj" -- FAILED.

실제로 해당 sdk:3.1-buster 이미지를 직접 실행해도,

c:\temp> docker run --name test -it mcr.microsoft.com/dotnet/core/sdk:3.1-buster /bin/bash

root@f133b3e361aa:/# apt-get update && apt-get install -y --no-install-recommends unzip && rm -rf /var/lib/apt/lists/*
Get:1 http://security.debian.org/debian-security buster/updates InRelease [65.4 kB]
Get:2 http://deb.debian.org/debian buster InRelease [122 kB]
Get:3 http://deb.debian.org/debian buster-updates InRelease [49.3 kB]
Get:4 http://deb.debian.org/debian buster/main amd64 Packages [7907 kB]
Reading package lists... Done
E: Release file for http://security.debian.org/debian-security/dists/buster/updates/InRelease is not valid yet (invalid for another 10d 9h 15min 14s). Updates for this repository will not be applied.
E: Release file for http://deb.debian.org/debian/dists/buster-updates/InRelease is not valid yet (invalid for another 9d 23h 51min 36s). Updates for this repository will not be applied.

오류가 발생하기는 마찬가지입니다. 일단, 이런 상황에서는 또 다른 stage 하나를 추가해서 처리하면 됩니다. 기반 이미지는... 그냥 ^^ 익숙한 걸로 2.1로 잘 되었으니 3.1의 경우 (에러가 발생한다면) 다음과 같이 우회해서 처리할 수 있습니다.

FROM mcr.microsoft.com/dotnet/core/runtime:3.1-buster-slim AS base
WORKDIR /app

FROM mcr.microsoft.com/dotnet/core/sdk:2.1-stretch AS unziphelper
RUN apt-get update && apt-get install -y --no-install-recommends unzip && rm -rf /var/lib/apt/lists/*
WORKDIR /extracted
COPY ./ConsoleApp1/test.zip .
RUN unzip test.zip

FROM mcr.microsoft.com/dotnet/core/sdk:3.1-buster AS build
WORKDIR /src
COPY ["ConsoleApp1/ConsoleApp1.csproj", "ConsoleApp1/"]
RUN dotnet restore "ConsoleApp1/ConsoleApp1.csproj"
COPY . .
WORKDIR "/src/ConsoleApp1"
RUN dotnet build "ConsoleApp1.csproj" -c Release -o /app/build

FROM build AS publish
RUN dotnet publish "ConsoleApp1.csproj" -c Release -o /app/publish

FROM base AS final
WORKDIR /app
COPY --from=publish /app/publish .
COPY --from=unziphelper /extracted ./extracted
ENTRYPOINT ["dotnet", "ConsoleApp1.dll"]




참고로, 비주얼 스튜디오의 "Build Docker Image"를 메뉴로 이미지를 만들다 보면 <none>에 해당하는 항목이 쌓일 수 있습니다. 그런 경우 다음의 명령어로 지워주면 끝!

// https://www.sysnet.pe.kr/2/0/11738
// https://www.sysnet.pe.kr/2/0/11708

FOR /F %i IN ('docker images -f "dangling=true" -q') do docker rmi %i




[이 글에 대해서 여러분들과 의견을 공유하고 싶습니다. 틀리거나 미흡한 부분 또는 의문 사항이 있으시면 언제든 댓글 남겨주십시오.]





[최초 등록일: ]
[최종 수정일: 8/5/2020 ]

Creative Commons License
이 저작물은 크리에이티브 커먼즈 코리아 저작자표시-비영리-변경금지 2.0 대한민국 라이센스에 따라 이용하실 수 있습니다.
by SeongTae Jeong, mailto:techsharer@outlook.com

비밀번호

댓글 쓴 사람
 




[1]  2  3  4  5  6  7  8  9  10  11  12  13  14  15  ...
NoWriterDateCnt.TitleFile(s)
12350정성태9/25/2020113Windows: 175. 윈도우 환경에서 클라이언트 소켓의 최대 접속 수파일 다운로드1
12349정성태9/25/202053Linux: 32. Ubuntu 20.04 - docker를 위한 tcp 바인딩 추가
12348정성태9/25/202033오류 유형: 658. 리눅스 docker - Got permission denied while trying to connect to the Docker daemon socket at unix:///var/run/docker.sock
12347정성태9/25/202085Windows: 174. WSL 2의 네트워크 통신 방법
12346정성태9/25/202033오류 유형: 657. IIS - http://localhost 방문 시 Service Unavailable 503 오류 발생
12345정성태9/25/202030오류 유형: 656. iisreset 실행 시 "Restart attempt failed." 오류가 발생하지만 웹 서비스는 정상적인 경우
12344정성태9/25/202043Windows: 173. 서비스 관리자에 "IIS Admin Service"가 등록되어 있지 않다면?
12343정성태9/24/2020174.NET Framework: 945. C# - 닷넷 응용 프로그램에서 메모리 누수가 발생할 수 있는 패턴
12342정성태9/25/2020130디버깅 기술: 171. windbg - 인스턴스가 살아 있어 메모리 누수가 발생하고 있는지 확인하는 방법
12341정성태9/23/2020171.NET Framework: 944. C# - 인스턴스가 살아 있어 메모리 누수가 발생하고 있는지 확인하는 방법파일 다운로드1
12340정성태9/23/202095.NET Framework: 943. WPF - WindowsFormsHost를 담은 윈도우 생성 시 메모리 누수
12339정성태9/21/202070오류 유형: 655. 코어 모드의 윈도우는 GUI 모드의 윈도우로 교체가 안 됩니다.
12338정성태9/21/202042오류 유형: 654. 우분투 설치 시 "CHS: Error 2001 reading sector ..." 오류 발생
12337정성태9/21/202044오류 유형: 653. Windows - Time zone 설정을 바꿔도 반영이 안 되는 경우
12336정성태9/21/2020152.NET Framework: 942. C# - WOL(Wake On Lan) 구현
12335정성태9/21/202054Linux: 31. 우분투 20.04 초기 설정 - 고정 IP 및 SSH 설치
12334정성태9/21/202034오류 유형: 652. windbg - !py 확장 명령어 실행 시 "failed to find python interpreter"
12333정성태9/20/2020102.NET Framework: 941. C# - 전위/후위 증감 연산자에 대한 오버로딩 구현 (2)
12332정성태9/18/202090.NET Framework: 940. C# - Windows Forms ListView와 DataGridView의 예제 코드파일 다운로드1
12331정성태9/24/202081오류 유형: 651. repadmin /syncall - 0x80090322 The target principal name is incorrect.
12330정성태9/20/2020231.NET Framework: 939. C# - 전위/후위 증감 연산자에 대한 오버로딩 구현 [2]파일 다운로드1
12329정성태9/16/2020116오류 유형: 650. ASUS 메인보드 관련 소프트웨어 설치 후 ArmouryCrate.UserSessionHelper.exe 프로세스 무한 종료 현상
12328정성태9/16/202089VS.NET IDE: 150. TFS의 이력에서 "Get This Version"과 같은 기능을 Git으로 처리한다면?
12327정성태9/12/2020148.NET Framework: 938. C# - ICS(Internet Connection Sharing) 제어파일 다운로드1
12326정성태9/12/2020138개발 환경 구성: 516. Azure VM의 Network Adapter를 실수로 비활성화한 경우
[1]  2  3  4  5  6  7  8  9  10  11  12  13  14  15  ...