Microsoft MVP성태의 닷넷 이야기
글쓴 사람
홈페이지
첨부 파일
 

pdb 파일을 다운로드하기 위한 symchk.exe 실행에 필요한 최소 파일

windbg 설치 후 함께 있는 symchk.exe를 이용하면 명령행에서 쉽게 PDB 파일을 다운로드할 수 있습니다.

Using SymChk
; https://docs.microsoft.com/en-us/windows-hardware/drivers/debugger/using-symchk

예를 들어, "ntdll.dll"의 pdb 파일을 다운로드하려면 다음과 같이 명령을 내리면 됩니다.

symchk.exe c:\WINDOWS\system32\ntdll.dll /s http://msdl.microsoft.com/download/symbols

[또는, 다운로드할 폴더를 지정해서]

symchk.exe c:\WINDOWS\system32\ntdll.dll /s SRV*c:\temp*http://msdl.microsoft.com/download/symbols




그런데 symchk.exe만 복사해 실행하면 SymbolCheck.dll이 없다고 오류가 발생합니다.

The code execution cannot proceed because SymbolCheck.dll was not found. Reinstalling the program may fix this problem. 

SymbolCheck.dll이(가) 없어 코드 실행을 진행할 수 없습니다. 프로그램을 다시 설치하면 이 문제가 해결될 수 있습니다. 

당연히 symchk.exe와 동일한 폴더에 있던 SymbolCheck.dll을 복사해 주면 이 부분은 해결되지만 그래도 다음과 같이 여전히 pdb 다운로드에는 실패합니다.

c:\temp> symchk.exe c:\WINDOWS\system32\ntdll.dll /s http://msdl.microsoft.com/download/symbols
SYMCHK: ntdll.dll            FAILED  - ntdll.pdb mismatched or not found

SYMCHK: FAILED files = 1
SYMCHK: PASSED + IGNORED files = 0

좀 더 오류 내용을 확인하기 위해 "/v" 옵션을 주면 symsrv.dll이 없다는 단서를 얻을 수 있습니다.

c:\temp> symchk.exe /v c:\WINDOWS\system32\ntdll.dll /s SRV*c:\temp*http://msdl.microsoft.com/download/symbols
[SYMCHK] Searching for symbols to c:\WINDOWS\system32\ntdll.dll in path http://msdl.microsoft.com/download/symbols
DBGHELP: Symbol Search Path: http://msdl.microsoft.com/download/symbols
[SYMCHK] Using search path "http://msdl.microsoft.com/download/symbols"
DBGHELP: No header for c:\WINDOWS\system32\ntdll.dll.  Searching for image on disk
DBGHELP: c:\WINDOWS\system32\ntdll.dll - OK
DBGHELP: symsrv.dll load failure
DBGHELP: http://msdl.microsoft.com/download/symbols\ntdll.pdb - file not found
DBGHELP: http://msdl.microsoft.com/download/symbols\dll\ntdll.pdb - file not found
DBGHELP: http://msdl.microsoft.com/download/symbols\symbols\dll\ntdll.pdb - file not found
DBGHELP: ntdll - no symbols loaded
[SYMCHK] MODULE64 Info ----------------------
[SYMCHK] Struct size: 1680 bytes
[SYMCHK] Base: 0x180000000
[SYMCHK] Image size: 2031616 bytes
[SYMCHK] Date: 0x99ca0526
[SYMCHK] Checksum: 0x001ed133
[SYMCHK] NumSyms: 0
[SYMCHK] SymType: SymNone
[SYMCHK] ModName: ntdll
[SYMCHK] ImageName: c:\WINDOWS\system32\ntdll.dll
[SYMCHK] LoadedImage: c:\WINDOWS\system32\ntdll.dll
[SYMCHK] PDB: ""
[SYMCHK] CV: RSDS
[SYMCHK] CV DWORD: 0x53445352
[SYMCHK] CV Data:  ntdll.pdb
[SYMCHK] PDB Sig:  0
[SYMCHK] PDB7 Sig: {0C2E19EA-1901-E9B8-2E45-67D2D21E56D2}
[SYMCHK] Age: 1
[SYMCHK] PDB Matched:  TRUE
[SYMCHK] DBG Matched:  TRUE
[SYMCHK] Line nubmers: FALSE
[SYMCHK] Global syms:  FALSE
[SYMCHK] Type Info:    FALSE
[SYMCHK] ------------------------------------
SymbolCheckVersion  0x00000002
Result              0x00010001
DbgFilename         ntdll.dbg
DbgTimeDateStamp    0x00000000
DbgSizeOfImage      0x00000000
DbgChecksum         0x00000000
PdbFilename         ntdll.pdb
PdbSignature        {0C2E19EA-1901-E9B8-2E45-67D2D21E56D2}
PdbDbiAge           0x00000001
[SYMCHK] [ 0x00000000 - 0x00010001 ] Checked "c:\WINDOWS\system32\ntdll.dll"
SYMCHK: ntdll.dll            FAILED  - ntdll.pdb mismatched or not found

SYMCHK: FAILED files = 1
SYMCHK: PASSED + IGNORED files = 0

따라서 symsrv.dll도 복사해 주는데 그래도 여전히 pdb 다운로드에는 실패합니다. 이쯤 해서 depends.exe를 이용해 symchk.exe의 의존성을 살펴보면 dbghelp.dll과 dbgeng.dll이 걸려 있는 것을 볼 수 있습니다.

그런데 실제로 테스트해 보면 dbghelp.dll만 필요한 것을 알 수 있습니다. 결국, symchk.exe를 정상적으로 실행하려면 다음의 파일만 복사해 오면 됩니다.

  • symchk.exe
  • dbghelp.dll
  • SymbolCheck.dll
  • symsrv.dll




[이 글에 대해서 여러분들과 의견을 공유하고 싶습니다. 틀리거나 미흡한 부분 또는 의문 사항이 있으시면 언제든 댓글 남겨주십시오.]

[연관 글]





[최초 등록일: ]
[최종 수정일: 12/25/2019 ]

Creative Commons License
이 저작물은 크리에이티브 커먼즈 코리아 저작자표시-비영리-변경금지 2.0 대한민국 라이센스에 따라 이용하실 수 있습니다.
by SeongTae Jeong, mailto:techsharer@outlook.com

비밀번호

댓글 쓴 사람
 



2020-07-29 03시47분
OFFLINE 에서 메모리 덤프를 분석할 때 필요한 TIP
; https://kuaaan.tistory.com/509

symchk.exe /id "G:\dump\memorydump.dmp" /om C:\temp\symbolinfo.txt
symchk.exe /ie notepad.exe /om C:\temp\symbolinfo.txt
symchk.exe /if c:\Windows\system32\FirewallAPI.dll /om c:\temp\symbolinfo.txt

symchk.exe /im c:\temp\symbolinfo.txt /s SRV*C:\Temp\SYMBOLS*http://msdl.microsoft.com/download/symbols

정성태

[1]  2  3  4  5  6  7  8  9  10  11  12  13  14  15  ...
NoWriterDateCnt.TitleFile(s)
12289정성태8/6/20204개발 환경 구성: 502. Portainer에 윈도우 컨테이너를 등록하는 방법
12288정성태8/5/202016오류 유형: 637. WCF - The protocol 'net.tcp' does not have an implementation of HostedTransportConfiguration type registered.
12287정성태8/5/202018오류 유형: 636. C# - libdl.so를 DllImport로 연결 시 docker container 내에서 System.DllNotFoundException 예외 발생
12286정성태8/5/202014개발 환경 구성: 501. .NET Core 용 container 이미지 만들 때 unzip이 필요한 경우
12285정성태8/4/202020오류 유형: 635. 윈도우 10 업데이트 - 0xc1900209
12284정성태8/4/202039디버깅 기술: 169. Hyper-V의 VM에 대한 메모리 덤프를 뜨는 방법
12283정성태8/3/202028디버깅 기술: 168. windbg - 필터 드라이버 확인하는 확장 명령어(!fltkd)
12282정성태8/2/202039디버깅 기술: 167. windbg 디버깅 사례: AppDomain 간의 static 변수 사용으로 인한 crash (2)
12281정성태8/2/2020130개발 환경 구성: 500. (PDB 연결이 없는) DLL의 소스 코드 디버깅을 dotPeek 도구로 해결하는 방법
12280정성태8/2/202037오류 유형: 634. 오라클 (평생) 무료 클라우드 VM 생성 후 SSH 접속 시 키 오류 발생
12279정성태7/29/202050개발 환경 구성: 499. 닷넷에서 접근해보는 InterSystems의 Cache 데이터베이스파일 다운로드1
12278정성태8/2/202061VS.NET IDE: 149. ("Binary was not built with debug information" 상태로) 소스 코드 디버깅이 안되는 경우
12277정성태8/2/202071개발 환경 구성: 498. DEVPATH 환경 변수의 사용 예 - .NET Reflector의 (PDB 연결이 없는) DLL의 소스 코드 디버깅
12276정성태7/23/202075.NET Framework: 930. 개발자를 위한 닷넷 어셈블리 바인딩 - DEVPATH 환경 변수
12275정성태7/28/202094개발 환경 구성: 497. 닷넷에서 접근해보는 InterSystems의 IRIS Data Platform 데이터베이스파일 다운로드1
12274정성태7/21/202073개발 환경 구성: 496. Azure - Blob Storage Account의 Location 이전 방법파일 다운로드1
12273정성태7/20/2020180개발 환경 구성: 495. Azure - Location이 다른 웹/DB 서버의 경우 발생하는 성능 하락
12272정성태7/16/202090.NET Framework: 929. (StrongName의 버전 구분이 필요 없는) .NET Core 어셈블리 바인딩 규칙파일 다운로드1
12271정성태7/16/202072.NET Framework: 928. .NET Framework의 Strong-named 어셈블리 바인딩 (2) - 런타임에 바인딩 리디렉션파일 다운로드1
12270정성태7/16/202047오류 유형: 633. SSL_CTX_use_certificate_file - error:140AB18F:SSL routines:SSL_CTX_use_certificate:ee key too small
12269정성태7/16/202059오류 유형: 632. .NET Core 웹 응용 프로그램 - The process was terminated due to an unhandled exception.
12268정성태7/15/202061오류 유형: 631. .NET Core 웹 응용 프로그램 오류 - HTTP Error 500.35 - ANCM Multiple In-Process Applications in same Process
12267정성태7/15/2020127.NET Framework: 927. C# - 윈도우 프로그램에서 Credential Manager를 이용한 보안 정보 저장파일 다운로드1
12266정성태7/14/2020128오류 유형: 630. 사용자 계정을 지정해 CreateService API로 서비스를 등록한 경우 "Error 1069: The service did not start due to a logon failure." 오류발생
12265정성태7/10/202080오류 유형: 629. Visual Studio - 웹 애플리케이션 실행 시 "Unable to connect to web server 'IIS Express'." 오류 발생
[1]  2  3  4  5  6  7  8  9  10  11  12  13  14  15  ...