Microsoft MVP성태의 닷넷 이야기
글쓴 사람
정성태 (techsharer at outlook.com)
홈페이지
첨부 파일
 

XSD 파일을 포함한 프로젝트 - The type or namespace name 'TypedTableBase<>' does not exist in the namespace 'System.Data'

제 경우에, 기존 .NET 4.0 프로젝트를 .NET 4.6으로 Target Framework을 변경했더니, 곧바로 다음과 같은 예외가 발생했습니다.

Rebuild started...
1>------ Rebuild All started: Project: Jennifer40.WebSiteTest4, Configuration: Debug x64 ------
1>C:\temp\MyTestWebApp\AccountDataSet.Designer.cs(280,69,280,95): error CS0234: The type or namespace name 'TypedTableBase<>' does not exist in the namespace 'System.Data' (are you missing an assembly reference?)
1>C:\temp\MyTestWebApp\AccountDataSet.Designer.cs(395,59,395,64): error CS0115: 'AccountDataSet.AccountDataTable.Clone()': no suitable method found to override
1>C:\temp\MyTestWebApp\AccountDataSet.Designer.cs(403,62,403,76): error CS0115: 'AccountDataSet.AccountDataTable.CreateInstance()': no suitable method found to override
1>C:\temp\MyTestWebApp\AccountDataSet.Designer.cs(442,60,442,77): error CS0115: 'AccountDataSet.AccountDataTable.NewRowFromBuilder(DataRowBuilder)': no suitable method found to override
1>C:\temp\MyTestWebApp\AccountDataSet.Designer.cs(448,52,448,62): error CS0115: 'AccountDataSet.AccountDataTable.GetRowType()': no suitable method found to override
1>C:\temp\MyTestWebApp\AccountDataSet.Designer.cs(454,37,454,49): error CS0115: 'AccountDataSet.AccountDataTable.OnRowChanged(DataRowChangeEventArgs)': no suitable method found to override
1>C:\temp\MyTestWebApp\AccountDataSet.Designer.cs(463,37,463,50): error CS0115: 'AccountDataSet.AccountDataTable.OnRowChanging(DataRowChangeEventArgs)': no suitable method found to override
1>C:\temp\MyTestWebApp\AccountDataSet.Designer.cs(472,37,472,49): error CS0115: 'AccountDataSet.AccountDataTable.OnRowDeleted(DataRowChangeEventArgs)': no suitable method found to override
1>C:\temp\MyTestWebApp\AccountDataSet.Designer.cs(481,37,481,50): error CS0115: 'AccountDataSet.AccountDataTable.OnRowDeleting(DataRowChangeEventArgs)': no suitable method found to override
========== Rebuild All: 0 succeeded, 1 failed, 0 skipped ==========

^^ 당황하지 마시고, 위의 경우 오류가 난 파일명이 AccountDataSet.Designer.cs 파일인데요, 그렇다면 해당 프로젝트에 AccountDataSet.xsd 파일이 있을 것입니다. 그 파일을 열어서 단순히 "Ctrl + S(Save)" 키를 눌러 한 번 더 저장하면 AccountDataSet.Designer.cs 파일의 소스 코드가 다시 재생성됩니다.

이후로 빌드하면 오류 메시지가 사라져 있을 것입니다.




[이 글에 대해서 여러분들과 의견을 공유하고 싶습니다. 틀리거나 미흡한 부분 또는 의문 사항이 있으시면 언제든 댓글 남겨주십시오.]



donaricano-btn



[최초 등록일: ]
[최종 수정일: 5/3/2021

Creative Commons License
이 저작물은 크리에이티브 커먼즈 코리아 저작자표시-비영리-변경금지 2.0 대한민국 라이센스에 따라 이용하실 수 있습니다.
by SeongTae Jeong, mailto:techsharer at outlook.com

비밀번호

댓글 쓴 사람
 




[1]  2  3  4  5  6  7  8  9  10  11  12  13  14  15  ...
NoWriterDateCnt.TitleFile(s)
12739정성태7/28/202114오류 유형: 746. Azure Active Directory - IDW10106: The 'ClientId' option must be provided.
12738정성태7/28/202113오류 유형: 745. Azure Active Directory - Client credential flows must have a scope value with /.default suffixed to the resource identifier (application ID URI).
12737정성태7/28/202118오류 유형: 744. Azure Active Directory - The resource principal named api://...[client_id]... was not found in the tenant
12736정성태7/28/202117오류 유형: 743. Active Azure Directory에서 "API permissions"의 권한 설정이 "Not granted for ..."로 나오는 문제
12735정성태7/27/202159.NET Framework: 1081. C# - Azure AD 인증을 지원하는 데스크톱 애플리케이션 예제(Windows Forms)파일 다운로드1
12734정성태7/26/202173스크립트: 20. 특정 단어로 시작하거나/끝나는 문자열을 포함/제외하는 정규 표현식 - Look-around
12733정성태7/23/202178.NET Framework: 1081. Self-Contained/SingleFile 유형의 .NET Core/5+ 실행 파일을 임베딩한다면?파일 다운로드2
12732정성태7/23/202128오류 유형: 742. SharePoint - The super user account utilized by the cache is not configured.
12731정성태7/23/202137개발 환경 구성: 584. Add Internal URLs 화면에서 "Save" 버튼이 비활성화 된 경우
12730정성태7/23/202145개발 환경 구성: 583. Visual Studio Code - Go 코드에서 입력을 받는 경우
12729정성태7/22/202158.NET Framework: 1080. xUnit 단위 테스트에 메서드/클래스 수준의 문맥 제공 - Fixture
12728정성태7/22/202162.NET Framework: 1079. MSTestv2 단위 테스트에 메서드/클래스/어셈블리 수준의 문맥 제공
12727정성태7/21/2021120.NET Framework: 1078. C# 단위 테스트 - MSTestv2/NUnit의 Assert.Inconclusive 사용법(?)
12726정성태7/21/202185VS.NET IDE: 169. 비주얼 스튜디오 - 단위 테스트 선택 시 MSTestv2 외의 xUnit, NUnit 사용법
12725정성태7/21/202135오류 유형: 741. Failed to find the "go" binary in either GOROOT() or PATH
12724정성태7/21/2021105개발 환경 구성: 582. 윈도우 환경에서 Visual Studio Code + Go (Zip) 개발 환경 [1]
12723정성태7/21/202145오류 유형: 740. SharePoint - Alternate access mappings have not been configured 경고
12722정성태7/20/202196오류 유형: 739. MSVCR110.dll이 없어 exe 실행이 안 되는 경우
12721정성태7/20/202151오류 유형: 738. The trust relationship between this workstation and the primary domain failed. - 세 번째 이야기
12720정성태7/19/202187Linux: 43. .NET Core/5+ 응용 프로그램의 Ubuntu (Debian) 패키지 준비
12719정성태7/19/202187오류 유형: 737. SharePoint 설치 시 "0x800710D8 The object identifier does not represent a valid object." 오류 발생
12718정성태7/19/2021119개발 환경 구성: 581. Windows에서 WSL로 파일 복사 시 root 소유권으로 적용되는 문제파일 다운로드1
12717정성태7/18/202196Windows: 195. robocopy에서 파일의 ADS(Alternate Data Stream) 정보 복사를 제외하는 방법
12716정성태7/17/202185개발 환경 구성: 580. msbuild의 Exec Task에 robocopy를 사용하는 방법파일 다운로드1
12715정성태7/17/202180오류 유형: 736. Windows - MySQL zip 파일 버전의 "mysqld --skip-grant-tables" 실행 시 비정상 종료
[1]  2  3  4  5  6  7  8  9  10  11  12  13  14  15  ...