Microsoft MVP성태의 닷넷 이야기
글쓴 사람
정성태 (techsharer at outlook.com)
홈페이지
첨부 파일

msbuild의 Exec Task에 robocopy를 사용하는 방법

robocopy를 msbuild의 Exec Task에 추가해 볼까요? ^^

실습을 위해 .NET Core(또는 5+) 프로젝트를 만들고 csproj 파일에서 다음과 같이 빌드 후에 실행할 수 있는 Task를 하나 정의합니다.

<Project Sdk="Microsoft.NET.Sdk">

    <PropertyGroup>
        <OutputType>Exe</OutputType>
        <TargetFramework>net5.0</TargetFramework>
    </PropertyGroup>

    <Target Name="MyAfterBuild"  AfterTargets="CoreBuild">
        <Message Importance="high" Text="AfterBuild: $(ProjectDir)$(OutDir)" />
    </Target>

</Project>

실제로 정의한 Task가 실행되는지 저렇게 Message 작업으로 "Importance" 값을 "High"로 두고 테스트할 수 있습니다. 이와 함께 내부 작업에서 사용하는 Property/Item 이름을 함께 확인해 주면 디버깅에 도움이 됩니다. 위와 같이 설정하고, 빌드를 해보면 다음과 같은 출력 결과를 확인할 수 있습니다.

Rebuild started...
Restored C:\temp\ConsoleApp1\ConsoleApp1\ConsoleApp1.csproj (in 2 ms).
1>------ Rebuild All started: Project: ConsoleApp1, Configuration: Debug Any CPU ------
1>You are using a preview version of .NET. See: https://aka.ms/dotnet-core-preview
1>ConsoleApp1 -> C:\temp\ConsoleApp1\ConsoleApp1\bin\Debug\ConsoleApp1.dll
1>AfterBuild: C:\temp\ConsoleApp1\ConsoleApp1\bin\Debug\
========== Rebuild All: 1 succeeded, 0 failed, 0 skipped ==========

자, 그럼 빌드 결과물을 별도의 디렉터리로 robocopy를 이용해 복사해 볼까요? ^^

<Target Name="MyAfterBuild"  AfterTargets="CoreBuild">
    <Message Importance="high" Text="AfterBuild: $(ProjectDir)$(OutDir)" />
    <Exec Command="robocopy $(ProjectDir)$(OutDir) c:\temp *.* /S" />
</Target>

빌드하면, c:\temp 디렉터리에 정상적으로 복사가 되었지만 빌드 실패를 알리는 메시지가 나옵니다.

Error MSB3073 The command "robocopy c:\temp\ConsoleApp1\ConsoleApp1\bin\Debug\ c:\temp *.* /S" exited with code 1.

왜냐하면, 이전에도 설명한 것처럼 robocopy는 복사가 되었을 때 exit code가 0이 아니기 때문입니다.

Build Events에 robocopy 작업이 있는 경우 "VCEnd exited with code 3" 오류 발생
; https://www.sysnet.pe.kr/2/0/1813

즉, 우리가 실습한 경우에는 robocopy가 exit code를 1을 반환한 것입니다. 이 오류를 없애려면, 위의 글에서 했던 것처럼 강제로 "exit 0" 처리를 해줘야 합니다.




Exec Task에서 이런 처리를 할 수 있는 방법으로 2가지 정도가 있습니다.

msbuild fails with successful robocopy exit code
; https://stackoverflow.com/questions/39795328/msbuild-fails-with-successful-robocopy-exit-code

우선 한 줄로 처리할 수 있는 방법이 선호될 테지만,

<Exec Command="(robocopy $(ProjectDir)$(OutDir) c:\temp /MIR)  ^&amp; IF %ERRORLEVEL% LEQ 1 exit 0" />

그래도 Error task 사용법도 익힐 겸 다음의 코드도 살펴볼까요?

<Exec ContinueOnError="true" Command="robocopy $(ProjectDir)$(OutDir) c:\temp /MIR">
    <Output TaskParameter="ExitCode" PropertyName="CopyErrorCode"/>
</Exec>
<Error Condition="$(CopyErrorCode) &gt; 8" Text="Robocopy failed"/>

그런데 위와 같은 상태로 빌드하면 다음과 같은 경고 메시지가 빌드에 남습니다.

1>C:\temp\ConsoleApp1\ConsoleApp1\ConsoleApp1.csproj(12,9): warning MSB3073: The command "robocopy C:\temp\ConsoleApp1\ConsoleApp1\bin\Debug\ c:\temp /MIR" exited with code 1.
1>C:\temp\ConsoleApp1\ConsoleApp1\ConsoleApp1.csproj(12,9): warning MSB4181: The "Exec" task returned false but did not log an error.
1>Done building project "ConsoleApp1.csproj".

왠지 기분 나쁩니다. ^^; 따라서 어차피 에러 상황은 Error Task에서 판정해 주기 때문에 저 오류 메시지가 발생하지 않도록 IgnoreExitCode 설정도 함께 추가하는 것이 좋습니다.

<Exec ContinueOnError="true" IgnoreExitCode="true" Command="robocopy $(ProjectDir)$(OutDir) c:\temp /MIR">
    <Output TaskParameter="ExitCode" PropertyName="CopyErrorCode"/>
</Exec>
<Error Condition="$(CopyErrorCode) &gt; 8" Text="Robocopy failed"/>




어떤 경우에는 robocopy를 사용 시 다음과 같은 식으로 오류가 발생합니다.

Rebuild started...
1>------ Rebuild All started: Project: ConsoleApp1, Configuration: Debug Any CPU ------
Restored C:\my work\ConsoleApp1\ConsoleApp1.csproj (in 2 ms).
1>You are using a preview version of .NET. See: https://aka.ms/dotnet-core-preview
1>ConsoleApp1 -> C:\my work\ConsoleApp1\bin\Debug\net5.0\ConsoleApp1.dll
1>AfterBuild: C:\my work\ConsoleApp1\bin\Debug\net5.0\
1>
1>-------------------------------------------------------------------------------
1>   ROBOCOPY     ::     Robust File Copy for Windows
1>-------------------------------------------------------------------------------
1>
1>  Started : 17 7월 2021 오전 11:44:53
1>   Source - C:\my\
1>     Dest - C:\my work\ConsoleApp1\work\ConsoleApp1\bin\Debug\net5.0\
1>
1>    Files :
1>  Options : /DCOPY:DA /COPY:DAT /R:1000000 /W:30
1>
1>------------------------------------------------------------------------------
1>
1>EXEC : warning : Invalid Parameter #3 : "c:\temp"
1>
1>       Simple Usage :: ROBOCOPY source destination /MIR
1>
1>             source :: Source Directory (drive:\path or \\server\share\path).
1>        destination :: Destination Dir  (drive:\path or \\server\share\path).
1>               /MIR :: Mirror a complete directory tree.
1>
1>    For more usage information run ROBOCOPY /?
1>
1>
1>****  /MIR can DELETE files as well as copy them !
1>C:\my work\ConsoleApp1\ConsoleApp1.csproj(15,9): error : Robocopy failed
1>Done building project "ConsoleApp1.csproj" -- FAILED.
========== Rebuild All: 0 succeeded, 1 failed, 0 skipped ==========

robocopy가 해석한 Source와 Dest 경로가 좀 이상한데요, 왜냐하면, "robocopy $(ProjectDir)$(OutDir) c:\temp /MIR"에서 "$(ProjectDir)"에 공백이 있기 때문입니다. (위의 경우는 프로젝트 디렉터리가 "c:\my work"에 위치합니다.)

이런 경우는, 디렉터리를 큰따옴표로 감싸야 하는데, msbuild에는 escape를 16진수로 쓰는 방법이 있습니다. 따라서 큰따옴표(")에 대한 16진수 ascii 코드인 %22를 사용해 다음과 같이 경로를 감쌀 수 있습니다.

<Exec ContinueOnError="true" IgnoreExitCode="true" Command="robocopy %22$(ProjectDir)$(OutDir)%22 c:\temp /MIR">
    <Output TaskParameter="ExitCode" PropertyName="CopyErrorCode"/>
</Exec>

그런데, 이렇게 하면 이제 다음과 같은 오류가 발생합니다.

1>------ Rebuild All started: Project: ConsoleApp1, Configuration: Debug Any CPU ------
Restored C:\my work\ConsoleApp1\ConsoleApp1.csproj (in 2 ms).
1>You are using a preview version of .NET. See: https://aka.ms/dotnet-core-preview
1>ConsoleApp1 -> C:\my work\ConsoleApp1\bin\Debug\net5.0\ConsoleApp1.dll
1>AfterBuild: C:\my work\ConsoleApp1\bin\Debug\net5.0\
1>
1>-------------------------------------------------------------------------------
1>   ROBOCOPY     ::     Robust File Copy for Windows
1>-------------------------------------------------------------------------------
1>
1>  Started : 17 7월 2021 오후 12:32:51
1>   Source : C:\my work\ConsoleApp1\bin\Debug\net5.0" c:\temp \MIR\
1>     Dest -
1>
1>    Files : *.*
1>
1>  Options : *.* /DCOPY:DA /COPY:DAT /R:1000000 /W:30
1>
1>------------------------------------------------------------------------------
1>
1>EXEC : warning : No Destination Directory Specified.
1>
1>       Simple Usage :: ROBOCOPY source destination /MIR
1>
1>             source :: Source Directory (drive:\path or \\server\share\path).
1>        destination :: Destination Dir  (drive:\path or \\server\share\path).
1>               /MIR :: Mirror a complete directory tree.
1>
1>    For more usage information run ROBOCOPY /?
1>
1>
1>****  /MIR can DELETE files as well as copy them !
1>C:\my work\ConsoleApp1\ConsoleApp1.csproj(15,9): error : Robocopy failed
1>Done building project "ConsoleApp1.csproj" -- FAILED.

여전히 robocopy는 Source와 Dest 디렉터리에 대한 잘못된 해석을 하고 있습니다. Source와 Dest에 지정한 실제 경로를 다시 잘 살펴보면,

Source: C:\my work\ConsoleApp1\bin\Debug\net5.0\
Destk: c:\temp

Source의 경우 끝에 역슬래시('\') 문자가 하나 더 들어 있어 그것이 큰따옴표와 이어지면서 escape 역할을 해 '\"' 문자열이 단일하게 큰따옴표(") 문자로 해석된 듯합니다. 따라서 이런 경우에는 역슬래시를 없애면 되는데요, 이것을 하려면 별도로 Trim 함수 등을 호출해야 하기 때문에 사용법만 더 복잡해집니다. 대신 마지막에 '\' 문자를 두지 않으면서 경로를 변조하지 않을 수 있는 '.'을 함께 쓰는 우회 방법을 선택할 수 있습니다.

<Exec ContinueOnError="true" IgnoreExitCode="true" Command="robocopy %22$(ProjectDir)$(OutDir).%22 c:\temp /MIR">
    <Output TaskParameter="ExitCode" PropertyName="CopyErrorCode"/>
</Exec>

(첨부 파일은 이 글의 예제 프로젝트를 포함합니다.)




참고로, %22 표기는 &quot;로 대체할 수 있습니다.

<Exec ContinueOnError="true" IgnoreExitCode="true" Command="robocopy %22$(ProjectDir)$(OutDir).&quot; c:\temp /MIR">
    <Output TaskParameter="ExitCode" PropertyName="CopyErrorCode"/>
</Exec>




[이 글에 대해서 여러분들과 의견을 공유하고 싶습니다. 틀리거나 미흡한 부분 또는 의문 사항이 있으시면 언제든 댓글 남겨주십시오.]



donaricano-btn



[최초 등록일: ]
[최종 수정일: 7/17/2021]

Creative Commons License
이 저작물은 크리에이티브 커먼즈 코리아 저작자표시-비영리-변경금지 2.0 대한민국 라이센스에 따라 이용하실 수 있습니다.
by SeongTae Jeong, mailto:techsharer at outlook.com

비밀번호

댓글 쓴 사람
 




1  2  3  4  5  [6]  7  8  9  10  11  12  13  14  15  ...
NoWriterDateCnt.TitleFile(s)
12738정성태7/28/2021607오류 유형: 745. Azure Active Directory - Client credential flows must have a scope value with /.default suffixed to the resource identifier (application ID URI).
12737정성태7/28/2021419오류 유형: 744. Azure Active Directory - The resource principal named api://...[client_id]... was not found in the tenant
12736정성태7/28/2021380오류 유형: 743. Active Azure Directory에서 "API permissions"의 권한 설정이 "Not granted for ..."로 나오는 문제
12735정성태7/27/2021480.NET Framework: 1081. C# - Azure AD 인증을 지원하는 데스크톱 애플리케이션 예제(Windows Forms)파일 다운로드1
12734정성태7/26/20211422스크립트: 20. 특정 단어로 시작하거나/끝나는 문자열을 포함/제외하는 정규 표현식 - Look-around
12733정성태7/23/2021461.NET Framework: 1081. Self-Contained/SingleFile 유형의 .NET Core/5+ 실행 파일을 임베딩한다면? [1]파일 다운로드2
12732정성태7/23/2021301오류 유형: 742. SharePoint - The super user account utilized by the cache is not configured.
12731정성태7/23/2021322개발 환경 구성: 584. Add Internal URLs 화면에서 "Save" 버튼이 비활성화 된 경우
12730정성태7/23/2021474개발 환경 구성: 583. Visual Studio Code - Go 코드에서 입력을 받는 경우
12729정성태7/22/2021379.NET Framework: 1080. xUnit 단위 테스트에 메서드/클래스 수준의 문맥 제공 - Fixture
12728정성태7/22/2021348.NET Framework: 1079. MSTestv2 단위 테스트에 메서드/클래스/어셈블리 수준의 문맥 제공
12727정성태7/21/2021574.NET Framework: 1078. C# 단위 테스트 - MSTestv2/NUnit의 Assert.Inconclusive 사용법(?)
12726정성태7/21/2021497VS.NET IDE: 169. 비주얼 스튜디오 - 단위 테스트 선택 시 MSTestv2 외의 xUnit, NUnit 사용법
12725정성태7/21/2021594오류 유형: 741. Failed to find the "go" binary in either GOROOT() or PATH
12724정성태7/21/2021919개발 환경 구성: 582. 윈도우 환경에서 Visual Studio Code + Go (Zip) 개발 환경 [1]
12723정성태7/21/2021456오류 유형: 740. SharePoint - Alternate access mappings have not been configured 경고
12722정성태7/20/2021464오류 유형: 739. MSVCR110.dll이 없어 exe 실행이 안 되는 경우
12721정성태7/20/2021472오류 유형: 738. The trust relationship between this workstation and the primary domain failed. - 세 번째 이야기
12720정성태7/19/2021428Linux: 43. .NET Core/5+ 응용 프로그램의 Ubuntu (Debian) 패키지 준비
12719정성태7/19/2021410오류 유형: 737. SharePoint 설치 시 "0x800710D8 The object identifier does not represent a valid object." 오류 발생
12718정성태7/19/2021421개발 환경 구성: 581. Windows에서 WSL로 파일 복사 시 root 소유권으로 적용되는 문제파일 다운로드1
12717정성태7/18/2021414Windows: 195. robocopy에서 파일의 ADS(Alternate Data Stream) 정보 복사를 제외하는 방법
12716정성태7/17/2021448개발 환경 구성: 580. msbuild의 Exec Task에 robocopy를 사용하는 방법파일 다운로드1
12715정성태7/17/20211238오류 유형: 736. Windows - MySQL zip 파일 버전의 "mysqld --skip-grant-tables" 실행 시 비정상 종료
12714정성태7/16/2021477오류 유형: 735. VCRUNTIME140.dll, MSVCP140.dll, VCRUNTIME140.dll, VCRUNTIME140_1.dll이 없어 exe 실행이 안 되는 경우
12713정성태7/16/2021620.NET Framework: 1077. C# - 동기 방식이면서 비동기 규약을 따르게 만드는 Task.FromResult파일 다운로드1
1  2  3  4  5  [6]  7  8  9  10  11  12  13  14  15  ...