Microsoft MVP성태의 닷넷 이야기
글쓴 사람
홈페이지
첨부 파일
 

vcpkg - "Building vcpkg.exe failed. Please ensure you have installed Visual Studio with the Desktop C++ workload and the Windows SDK for Desktop C++"

이 오류의 원인은 다양하겠지만, 제 경우에는 다음과 같은 상황에서도 발생했습니다.

Build FAILED.

       "c:/temp/vcpkg\toolsrc\dirs.proj" (default target) (1) ->
       "c:/temp/vcpkg\toolsrc\vcpkg\vcpkg.vcxproj" (Build target) (2:2) ->
       "c:/temp/vcpkg\toolsrc\vcpkglib\vcpkglib.vcxproj" (default target) (3:4) ->
       (ClCompile target) ->
         c:/temp/vcpkg\toolsrc\src\vcpkg\base\cofffilereader.cpp(248): error C4996: 'std::fpos<_Mbstatet>::seekpos
       ': warning STL4019: The member std::fpos::seekpos() is non-Standard, and is preserved only for compatibility wit
       h workarounds for old versions of Visual C++. It will be removed in a future release, and in this release always
        returns 0. Please use standards-conforming mechanisms to manipulate fpos, such as conversions to and from strea
       moff, or an integral type, instead. If you are receiving this message while compiling Boost.IOStreams, a fix has
        been submitted upstream to make Boost use standards-conforming mechanisms, as it does for other compilers. You
       can define _SILENCE_FPOS_SEEKPOS_DEPRECATION_WARNING to acknowledge that you have received this warning, or defi
       ne _REMOVE_FPOS_SEEKPOS to remove std::fpos::seekpos entirely. [c:/temp/vcpkg\toolsrc\vcpkglib\vcpkglib.vcxproj]

    0 Warning(s)
    1 Error(s)

Time Elapsed 00:00:08.10
c:/temp/vcpkg\scripts\bootstrap.ps1 : Building vcpkg.exe failed. Please ensure you have installed Visual Studio with the Desktop C++ workload and the Windows SDK for Desktop C++.
At line:1 char:4
+ & {& 'c:/temp/vcpkg\scripts\bootstrap.ps1'}
+    ~~~~~~~~~~~~~~~~~~~~~~~~~~~~~~~~~~~~~~~~~~~~
    + CategoryInfo          : NotSpecified: (:) [Write-Error], WriteErrorException
    + FullyQualifiedErrorId : Microsoft.PowerShell.Commands.WriteErrorException,bootstrap.ps1

즉, Visual Studio를 업그레이드하면서 Visual C++ 컴파일러가 보다 더 공격적으로 표준을 지키는 기본 동작을 하는 바람에 vcpkg 소스 코드가 빌드가 안 되는 것입니다.

이런 경우에 해법은 2가지가 있을 것입니다. 하나는 vcxproj 파일의 빌드 옵션에 /WX를 추가하는 것입니다.

/WX (Treat Linker Warnings as Errors)
; https://msdn.microsoft.com/en-us/library/ms235592.aspx

또는, 약간의 시간이 지나고 나면 vcpkg 개발팀도 이 문제를 인지하고 github 소스 코드를 업데이트할 것이므로 "git pull" 명령어로 최신 업데이트를 받아 보는 것입니다. 제 경우에는 후자의 조치로 해결을 했습니다. ^^




참고로, git pull 명령어가 다음과 같이 막힐 때가 있습니다.

c:/temp/vcpkg>git pull
error: Your local changes to the following files would be overwritten by merge:
        scripts/cmake/vcpkg_get_windows_sdk.cmake
        scripts/getWindowsSDK.ps1
Please commit your changes or stash them before you merge.
Aborting
Updating 76096c95..eccae2ad

메시지에 따라 다음과 같이 stash를 하든,

c:/temp/vcpkg>git stash
Saved working directory and index state WIP on master: 76096c95 Merge pull request #2381 from markgarcia/tbb-2018_U2

어차피 vcpkg의 소스 코드를 수정하지 않는다고 하면 clean을 해도 무방할 것입니다.




[이 글에 대해서 여러분들과 의견을 공유하고 싶습니다. 틀리거나 미흡한 부분 또는 의문 사항이 있으시면 언제든 댓글 남겨주십시오.]





[최초 등록일: ]
[최종 수정일: 12/19/2018 ]

Creative Commons License
이 저작물은 크리에이티브 커먼즈 코리아 저작자표시-비영리-변경금지 2.0 대한민국 라이센스에 따라 이용하실 수 있습니다.
by SeongTae Jeong, mailto:techsharer@outlook.com

비밀번호

댓글 쓴 사람
 




1  2  3  4  5  6  7  8  [9]  10  11  12  13  14  15  ...
NoWriterDateCnt.TitleFile(s)
12064정성태11/25/20191068오류 유형: 580. HTTP Error 500.0/500.33 - ANCM In-Process Handler Load Failure
12063정성태11/21/2019789디버깅 기술: 134. windbg - RtlReportCriticalFailure로부터 parameters 정보 찾는 방법
12062정성태12/20/2019656디버깅 기술: 133. windbg - CoTaskMemFree/FreeCoTaskMem에서 발생한 덤프 분석 사례 - 두 번째 이야기
12061정성태11/20/2019737Windows: 165. CoTaskMemAlloc/CoTaskMemFree과 윈도우 Heap의 관계
12060정성태11/21/2019814디버깅 기술: 132. windbg/Visual Studio - HeapFree x64의 동작 분석
12059정성태11/20/2019751디버깅 기술: 131. windbg/Visual Studio - HeapFree x86의 동작 분석
12058정성태11/19/2019728디버깅 기술: 130. windbg - CoTaskMemFree/FreeCoTaskMem에서 발생한 덤프 분석 사례
12057정성태11/18/2019512오류 유형: 579. Visual Studio - Memory 창에서 유효한 주소 영역임에도 "Unable to evaluate the expression." 오류 출력
12056정성태11/18/2019967개발 환경 구성: 464. "Microsoft Visual Studio Installer Projects" 프로젝트로 EXE 서명 및 MSI 파일 서명 방법파일 다운로드1
12055정성태11/17/2019528개발 환경 구성: 463. Visual Studio의 Ctrl + Alt + M, 1 (Memory 1) 등의 단축키가 동작하지 않는 경우
12054정성태11/15/2019941.NET Framework: 869. C# - 일부러 GC Heap을 깨뜨려 GC 수행 시 비정상 종료시키는 예제
12053정성태11/15/2019586Windows: 164. 윈도우 10 - 명령행 창(cmd.exe) 속성에 (DotumChe, GulimChe, GungsuhChe 등의) 한글 폰트가 없는 경우
12052정성태11/15/2019519오류 유형: 578. Azure - 일정(schedule)에 등록한 runbook이 1년 후 실행이 안 되는 문제(Reason - The key used is expired.)
12051정성태12/2/20191245개발 환경 구성: 462. 시작하자마자 비정상 종료하는 프로세스의 메모리 덤프 - procdump [1]
12050정성태11/14/2019776Windows: 163. AcLayers의 API 후킹과 FaultTolerantHeap
12049정성태11/13/2019573.NET Framework: 868. (닷넷 프로세스를 대상으로) 디버거 방식이 아닌 CLR Profiler를 이용해 procdump.exe 기능 구현
12048정성태11/12/2019801Windows: 163. GUID 이름의 볼륨에 해당하는 파티션을 찾는 방법
12047정성태11/12/20191303Windows: 163. 안전하게 eject시킨 USB 장치를 물리적인 재연결 없이 다시 인식시키는 방법
12046정성태11/9/2019710오류 유형: 577. windbg - The call to LoadLibrary(...\sos.dll) failed, Win32 error 0n193
12045정성태10/27/2019573오류 유형: 576. mstest.exe 실행 시 "Visual Studio Enterprise is required to execute the test." 오류 - 두 번째 이야기
12044정성태10/27/2019724오류 유형: 575. mstest.exe - System.Resources.MissingSatelliteAssemblyException: The satellite assembly named "Microsoft.VisualStudio.ProductKeyDialog.resources.dll, ..."
12043정성태10/27/2019729오류 유형: 574. Windows 10 설치 시 오류 - 0xC1900101 - 0x4001E
12042정성태10/26/2019670오류 유형: 573. OneDrive 하위에 위치한 Documents, Desktop 폴더에 대한 권한 변경 시 "Unable to display current owner"
12041정성태10/23/2019523오류 유형: 572. mstest.exe - The load test results database could not be opened.
12040정성태10/23/2019897오류 유형: 571. Unhandled Exception: System.Net.Mail.SmtpException: Transaction failed. The server response was: 5.2.0 STOREDRV.Submission.Exception:SendAsDeniedException.MapiExceptionSendAsDenied
12039정성태10/22/2019670스크립트: 16. cmd.exe의 for 문에서는 ERRORLEVEL이 설정되지 않는 문제
1  2  3  4  5  6  7  8  [9]  10  11  12  13  14  15  ...