Microsoft MVP성태의 닷넷 이야기
글쓴 사람
정성태 (techsharer at outlook.com)
홈페이지
첨부 파일
 

electronize - User Profile 디렉터리에 공백 문자가 있는 경우 빌드가 실패하는 문제

예를 들어, 윈도우의 사용자 이름이 "Default User"라고 가정해보겠습니다. 이런 경우라면 %USERPROFILE%이나 %LOCALAPPDATA%, %APPDATA% 등의 경로에 공백이 포함됩니다.

C:\temp> echo %USERPROFILE%
C:\Users\Default User

C:\temp> echo %LOCALAPPDATA%
C:\Users\Default User\AppData\Local

C:\temp> echo %APPDATA%
C:\Users\Default User\AppData\Roaming

이 상태에서 electronize로 빌드 시,

electronize build /target win-x64 /PublishReadyToRun false

다음과 같은 식의 오류가 발생하는데,

Error: EEXIST: file already exists, mkdir 'C:\Users\Default'
TypeError: Cannot read property 'loaded' of undefined
    at exit (C:\Program Files\nodejs\node_modules\npm\lib\utils\error-handler.js:98:27)
    at errorHandler (C:\Program Files\nodejs\node_modules\npm\lib\utils\error-handler.js:216:3)
    at C:\Program Files\nodejs\node_modules\npm\bin\npm-cli.js:77:20
    at cb (C:\Program Files\nodejs\node_modules\npm\lib\npm.js:225:22)
    at C:\Program Files\nodejs\node_modules\npm\lib\npm.js:263:24
    at C:\Program Files\nodejs\node_modules\npm\lib\config\core.js:83:7
    at Array.forEach (<anonymous>)
    at C:\Program Files\nodejs\node_modules\npm\lib\config\core.js:82:13
    at f (C:\Program Files\nodejs\node_modules\npm\node_modules\once\once.js:25:25)
    at afterExtras (C:\Program Files\nodejs\node_modules\npm\lib\config\core.js:173:20)
C:\Program Files\nodejs\node_modules\npm\lib\utils\error-handler.js:98
  var doExit = npm.config.loaded ? npm.config.get('_exit') : true
                          ^
TypeError: Cannot read property 'loaded' of undefined
    at exit (C:\Program Files\nodejs\node_modules\npm\lib\utils\error-handler.js:98:27)
    at process.errorHandler (C:\Program Files\nodejs\node_modules\npm\lib\utils\error-handler.js:216:3)
    at process.emit (events.js:198:13)
    at process._fatalException (internal/bootstrap/node.js:496:27)
Install for electron-builder@latest failed with code 7
F:\cloud_drive\Dropbox\articles\elec_net\kestrel_razor_sample\ConsoleApp1\obj\desktop\win-x64>
... done

npm ERR! code ENOLOCAL
npm ERR! Could not install from "User\AppData\Roaming\npm-cache\_npx\16672" as it does not contain a package.json file.
npm ERR! A complete log of this run can be found in:
npm ERR!     C:\Users\Default User\AppData\Roaming\npm-cache\_logs\2021-01-27T05_21_25_321Z-debug.log
Install for electron-builder@latest failed with code 1

출력에 나온 log 파일을 보면 node.exe에 전달된 경로가 이렇게 해석된 것을 확인할 수 있습니다.

0 info it worked if it ends with ok
1 verbose cli [ 'C:\\Program Files\\nodejs\\node.exe',
1 verbose cli   'C:\\Program Files\\nodejs\\node_modules\\npm\\bin\\npm-cli.js',
1 verbose cli   'install',
1 verbose cli   'electron-builder@latest',
1 verbose cli   '--global',
1 verbose cli   '--prefix',
1 verbose cli   'C:\\Users\\Default',
1 verbose cli   'User\\AppData\\Roaming\\npm-cache\\_npx\\16672',
1 verbose cli   '--loglevel',
1 verbose cli   'error',
1 verbose cli   '--json' ]
...[생략]...

원인을 유추해 보면, 저 경로는 "%APPDATA%" 경로에 포함된 공백이 명령행 인자에서 2개로 나눠져 인식이 되었기 때문입니다.




이에 대한 근본적인 원인을 해결하려면 저렇게 실행하는 코드를 수정해야 합니다. 가령 node.exe를 실행할 때 전달하는 %APPDATA%에 대한 경로를 다음과 같은 식으로 인용 부호로 묶어 전달해야 합니다.

c:\temp> node.exe "C:\Users\Default User\AppData\Roaming\npm-cache\_npx\16672" ...[생략]...

따라서 이러한 버그를 수정해 달라는 이슈를 생성하거나, 아니면 직접 소스 코드를 고쳐 빌드하는 수 밖에는 없습니다.




한 가지 다행이라면, 이렇게 경로에 '공백 문자'가 있는 경우 8.3 형식의 경로를 사용해 표현하는 것이 가능하다는 점입니다.

Windows - 도스 시절의 8.3 경로를 알아내는 방법
; https://www.sysnet.pe.kr/2/0/12511

가령, 이런 경우 electronize는 내부에서 "C:\Users\Default User\AppData\Roaming\npm-cache\_npx\21340"라는 경로를 아마도 다음과 같은 식으로 구했을 것입니다.

string path = GetEnvrionmentVairable("APPDATA"); // C:\Users\Default User\AppData\Roaming
string arg1 = path + "\npm-cache\_npx\16672";

따라서 환경 변수로 설정된 LOCALAPPDATA나, APPDATA에 대해 같은 경로로 대우받는 8.3 형식으로 명시하면 됩니다.

SET LOCALAPPDATA=C:\Users\DEFAULT~1\AppData\Local
SET APPDATA=C:\Users\DEFAULT~1\AppData\Roaming

이때 사용자 계정으로 등록된 "Default User"의 8.3 이름은 다음과 같은 명령어로 간단하게 구할 수 있습니다.

C:\temp> dir /X "%USERPROFILE%\.."
 Volume in drive C has no label.
 Volume Serial Number is C02C-196F

 Directory of C:\Users

2021-01-27  오후 02:33    <DIR>                       .
2021-01-27  오후 02:33    <DIR>                       ..
2020-12-24  오후 08:17    <DIR>          DEFAUL~1     Default User
2021-01-22  오후 07:42    <DIR>          MSSQLS~1     MSSQLSERVER
2020-12-03  오전 11:02    <DIR>          RDVGRA~1     RDV GRAPHICS SERVICE
2021-01-22  오후 07:42    <DIR>          SQLTEL~1     SQLTELEMETRY
               0 File(s)              0 bytes
               6 Dir(s)  50,487,128,064 bytes free

명령행에서 이렇게 설정하고 다시 문제가 되었던 빌드 명령을 수행하면,

c:\temp> SET LOCALAPPDATA=C:\Users\DEFAULT~1\AppData\Local
c:\temp> SET APPDATA=C:\Users\DEFAULT~1\AppData\Roaming

c:\temp> electronize build /target win-x64 /PublishReadyToRun false

정상적으로 실행이 되는 것을 확인할 수 있습니다.




[이 글에 대해서 여러분들과 의견을 공유하고 싶습니다. 틀리거나 미흡한 부분 또는 의문 사항이 있으시면 언제든 댓글 남겨주십시오.]



donaricano-btn



[최초 등록일: ]
[최종 수정일: 8/18/2021

Creative Commons License
이 저작물은 크리에이티브 커먼즈 코리아 저작자표시-비영리-변경금지 2.0 대한민국 라이센스에 따라 이용하실 수 있습니다.
by SeongTae Jeong, mailto:techsharer at outlook.com

비밀번호

댓글 쓴 사람
 




[1]  2  3  4  5  6  7  8  9  10  11  12  13  14  15  ...
NoWriterDateCnt.TitleFile(s)
12839정성태9/15/2021227.NET Framework: 1118. C# 10 - (17) 제네릭 타입의 특성 적용파일 다운로드1
12838정성태9/13/2021228.NET Framework: 1117. C# - Task에 전달한 Action, Func 유형에 따라 달라지는 async/await 비동기 처리 [2]파일 다운로드1
12837정성태9/11/2021132VC++: 151. Golang - fmt.Errorf, errors.Is, errors.As 설명
12836정성태9/10/202188Linux: 45. 리눅스 - 실행 중인 다른 프로그램의 출력을 확인하는 방법
12835정성태9/7/2021160.NET Framework: 1116. C# 10 - (16) CallerArgumentExpression 특성 추가파일 다운로드1
12834정성태9/7/202182오류 유형: 762. Visual Studio 2019 Build Tools - 'C:\Program' is not recognized as an internal or external command, operable program or batch file.
12833정성태9/6/2021146VC++: 150. Golang - TCP client/server echo 예제 코드파일 다운로드1
12832정성태9/6/202185VC++: 149. Golang - 인터페이스 포인터가 의미 있을까요?
12831정성태9/6/2021119VC++: 148. Golang - 채널에 따른 다중 작업 처리파일 다운로드1
12830정성태9/6/202184오류 유형: 761. Internet Explorer에서 파일 다운로드 시 "Your current security settings do not allow this file to be downloaded." 오류
12829정성태9/5/2021211.NET Framework: 1115. C# 10 - (15) 구조체 타입에 기본 생성자 정의 가능파일 다운로드1
12828정성태9/4/2021198.NET Framework: 1114. C# 10 - (14) 단일 파일 내에 적용되는 namespace 선언파일 다운로드1
12827정성태9/4/2021114스크립트: 27. 파이썬 - 웹 페이지 데이터 수집을 위한 scrapy Crawler 사용법 요약
12826정성태9/3/2021170.NET Framework: 1113. C# 10 - (13) 문자열 보간 성능 개선파일 다운로드1
12825정성태9/3/202171개발 환경 구성: 603. GoLand - WSL 환경과 연동
12824정성태9/2/2021150오류 유형: 760. 파이썬 tensorflow - Dst tensor is not initialized. 오류 메시지
12823정성태9/2/2021164스크립트: 26. 파이썬 - PyCharm을 이용한 fork 디버그 방법
12822정성태9/1/202198오류 유형: 759. 파이썬 tensorflow - ValueError: Shapes (...) and (...) are incompatible
12821정성태9/1/2021150.NET Framework: 1112. C# - .NET 6부터 공개된 ISpanFormattable 사용법
12820정성태9/1/202187VC++: 147. Golang - try/catch에 대응하는 panic/recover파일 다운로드1
12819정성태8/31/2021185.NET Framework: 1111. C# - FormattableString 타입
12818정성태8/31/2021119Windows: 198. 윈도우 - 작업 관리자에서 (tensorflow 등으로 인한) GPU 연산 부하 보는 방법
12817정성태8/31/202178스크립트: 25. 파이썬 - 윈도우 환경에서 directml을 이용한 tensorflow의 AMD GPU 사용 방법
12816정성태8/30/2021336스크립트: 24. 파이썬 - tensorflow 2.6 NVidia GPU 사용 방법 [2]
12815정성태8/30/2021199개발 환경 구성: 602. WSL 2 - docker-desktop-data, docker-desktop (%LOCALAPPDATA%\Docker\wsl\data\ext4.vhdx) 파일을 다른 디렉터리로 옮기는 방법
[1]  2  3  4  5  6  7  8  9  10  11  12  13  14  15  ...