Microsoft MVP성태의 닷넷 이야기
C/C++: 163. Visual Studio 2022 - DirectShow 예제 컴파일(WAV Dest) [링크 복사], [링크+제목 복사],
조회: 5134
글쓴 사람
정성태 (techsharer at outlook.com)
홈페이지
첨부 파일
 

Visual Studio 2022 - DirectShow 예제 컴파일(WAV Dest)

예전에 소개한,

Realtek 사운드 장치에서 재생되는 오디오를 GraphEditor로 녹음하는 방법
; https://www.sysnet.pe.kr/2/0/1631

WAV Dest 구성요소는 현재 github에서 소스코드를 구할 수 있습니다.

WAV Dest
; https://github.com/microsoft/Windows-classic-samples/tree/main/Samples/Win7Samples/multimedia/directshow/filters/wavdest

원래 저 프로젝트는 Visual Studio 2010용으로 만들어져 있어 현재는 프로젝트 파일을 2022로 마이그레이션을 해야 합니다. (물론, 2022에서 프로젝트를 열면 자동으로 해줍니다.)

이후 빌드하면 이런 에러가 나오는데요,

Rebuild started...
1>------ Rebuild All started: Project: WavDest, Configuration: Debug x64 ------
1>C:\Program Files\Microsoft Visual Studio\2022\Enterprise\MSBuild\Microsoft\VC\v170\Microsoft.Cpp.Analysis.props(24,5): warning MSB4211: The property "MsvcAnalysisPluginPath" is being set to a value for the first time, but it was already consumed at "C:\Program Files\Microsoft Visual Studio\2022\Enterprise\MSBuild\Microsoft\VC\v170\Microsoft.CodeAnalysis.Extensions.props (33,5)".
1>cl : command line  warning D9035: option 'Gm' has been deprecated and will be removed in a future release
1>wavdest.cpp
1>C:\Program Files\Microsoft Visual Studio\2022\Enterprise\MSBuild\Microsoft\VC\v170\Microsoft.CppCommon.targets(1096,5): error MSB6006: "link.exe" exited with code 1104.
1>LINK : fatal error LNK1104: cannot open file 'strmbasd.lib'
1>Done building project "WavDest.vcxproj" -- FAILED.
========== Rebuild All: 0 succeeded, 1 failed, 0 skipped ==========
========== Rebuild started at 9:42 AM and took 02.792 seconds ==========

프로젝트를 보면,

<AdditionalDependencies>..\..\BaseClasses\Debug\strmbasd.lib;winmm.lib;msvcrtd.lib;%(AdditionalDependencies)</AdditionalDependencies>

".\Windows-classic-samples\Samples\Win7Samples\multimedia\directshow\baseclasses" 프로젝트에 대한 의존성이 걸려 있으므로 baseclasses 프로젝트를 먼저 빌드해야 합니다. 이후 다시 WavDest를 빌드하면 여전히 오류가 발생하는데요,

Rebuild started...
1>------ Rebuild All started: Project: WavDest, Configuration: Debug x64 ------
1>C:\Program Files\Microsoft Visual Studio\2022\Enterprise\MSBuild\Microsoft\VC\v170\Microsoft.Cpp.Analysis.props(24,5): warning MSB4211: The property "MsvcAnalysisPluginPath" is being set to a value for the first time, but it was already consumed at "C:\Program Files\Microsoft Visual Studio\2022\Enterprise\MSBuild\Microsoft\VC\v170\Microsoft.CodeAnalysis.Extensions.props (33,5)".
1>cl : command line  warning D9035: option 'Gm' has been deprecated and will be removed in a future release
1>wavdest.cpp
1>   Creating library x64\Debug\WavDest.lib and object x64\Debug\WavDest.exp
1>strmbasd.lib(amfilter.obj) : error LNK2019: unresolved external symbol memcmp referenced in function "public: virtual long __cdecl CMediaSample::SetMediaType(struct _AMMediaType *)" (?SetMediaType@CMediaSample@@UEAAJPEAU_AMMediaType@@@Z)
1>strmbasd.lib(transfrm.obj) : error LNK2001: unresolved external symbol memcmp
1>strmbasd.lib(dllentry.obj) : error LNK2001: unresolved external symbol memcmp
1>strmbasd.lib(amvideo.obj) : error LNK2001: unresolved external symbol memcmp
1>wavdest.obj : error LNK2001: unresolved external symbol memcmp
1>strmbasd.lib(wxdebug.obj) : error LNK2001: unresolved external symbol memcmp
1>strmbasd.lib(combase.obj) : error LNK2001: unresolved external symbol memcmp
1>strmbasd.lib(mtype.obj) : error LNK2001: unresolved external symbol memcmp
1>wavdest.obj : error LNK2019: unresolved external symbol memcpy referenced in function "public: virtual long __cdecl CWavDestFilter::StopStreaming(void)" (?StopStreaming@CWavDestFilter@@UEAAJXZ)
1>strmbasd.lib(wxutil.obj) : error LNK2001: unresolved external symbol memcpy
1>strmbasd.lib(mtype.obj) : error LNK2001: unresolved external symbol memcpy
1>strmbasd.lib(amfilter.obj) : error LNK2001: unresolved external symbol memcpy
1>wavdest.obj : error LNK2019: unresolved external symbol memset referenced in function "public: virtual long __cdecl CWavDestFilter::StopStreaming(void)" (?StopStreaming@CWavDestFilter@@UEAAJXZ)
1>strmbasd.lib(mtype.obj) : error LNK2001: unresolved external symbol memset
1>strmbasd.lib(amfilter.obj) : error LNK2001: unresolved external symbol memset
1>msvcrtd.lib(gshandlereh4.obj) : error LNK2001: unresolved external symbol __CxxFrameHandler4
1>strmbasd.lib(mtype.obj) : error LNK2001: unresolved external symbol __CxxFrameHandler4
1>strmbasd.lib(amfilter.obj) : error LNK2001: unresolved external symbol __CxxFrameHandler4
1>strmbasd.lib(transfrm.obj) : error LNK2001: unresolved external symbol __CxxFrameHandler4
1>strmbasd.lib(wxlist.obj) : error LNK2001: unresolved external symbol __CxxFrameHandler4
1>wavdest.obj : error LNK2001: unresolved external symbol __CxxFrameHandler4
1>strmbasd.lib(wxdebug.obj) : error LNK2001: unresolved external symbol __CxxFrameHandler4
1>strmbasd.lib(wxutil.obj) : error LNK2001: unresolved external symbol __CxxFrameHandler4
1>strmbasd.lib(combase.obj) : error LNK2001: unresolved external symbol __CxxFrameHandler4
1>strmbasd.lib(wxdebug.obj) : error LNK2019: unresolved external symbol wcsrchr referenced in function "wchar_t * __cdecl wcsrchr(wchar_t *,wchar_t)" (?wcsrchr@@YAPEA_WPEA_W_W@Z)
1>strmbasd.lib(dllentry.obj) : error LNK2001: unresolved external symbol wcsrchr
1>  Hint on symbols that are defined and could potentially match:
1>    "wchar_t * __cdecl wcsrchr(wchar_t *,wchar_t)" (?wcsrchr@@YAPEA_WPEA_W_W@Z)
1>strmbasd.lib(wxdebug.obj) : error LNK2019: unresolved external symbol __imp___stdio_common_vswprintf referenced in function _vsnwprintf_l
1>strmbasd.lib(wxutil.obj) : error LNK2001: unresolved external symbol __imp___stdio_common_vswprintf
1>strmbasd.lib(dllsetup.obj) : error LNK2001: unresolved external symbol __imp___stdio_common_vswprintf
1>strmbasd.lib(dllentry.obj) : error LNK2001: unresolved external symbol __imp___stdio_common_vswprintf
1>strmbasd.lib(wxdebug.obj) : error LNK2019: unresolved external symbol __imp___stdio_common_vsprintf referenced in function _vsnprintf_l
1>strmbasd.lib(wxutil.obj) : error LNK2019: unresolved external symbol memmove referenced in function memmoveInternal
1>strmbasd.lib(amfilter.obj) : error LNK2001: unresolved external symbol _purecall
1>msvcrtd.lib(new_scalar.obj) : error LNK2019: unresolved external symbol _callnewh referenced in function "void * __cdecl operator new(unsigned __int64)" (??2@YAPEAX_K@Z)
1>msvcrtd.lib(new_scalar.obj) : error LNK2019: unresolved external symbol malloc referenced in function "void * __cdecl operator new(unsigned __int64)" (??2@YAPEAX_K@Z)
1>msvcrtd.lib(init.obj) : error LNK2019: unresolved external symbol _CrtDbgReport referenced in function _CRT_RTC_INIT
1>msvcrtd.lib(init.obj) : error LNK2019: unresolved external symbol _CrtDbgReportW referenced in function _CRT_RTC_INITW
1>msvcrtd.lib(dll_dllmain.obj) : error LNK2019: unresolved external symbol _initterm referenced in function "int __cdecl dllmain_crt_process_attach(struct HINSTANCE__ * const,void * const)" (?dllmain_crt_process_attach@@YAHQEAUHINSTANCE__@@QEAX@Z)
1>msvcrtd.lib(dll_dllmain.obj) : error LNK2019: unresolved external symbol _initterm_e referenced in function "int __cdecl dllmain_crt_process_attach(struct HINSTANCE__ * const,void * const)" (?dllmain_crt_process_attach@@YAHQEAUHINSTANCE__@@QEAX@Z)
1>msvcrtd.lib(dll_dllmain.obj) : error LNK2001: unresolved external symbol __C_specific_handler
1>msvcrtd.lib(utility.obj) : error LNK2001: unresolved external symbol __C_specific_handler
1>msvcrtd.lib(error.obj) : error LNK2019: unresolved external symbol strcpy_s referenced in function "void __cdecl _RTC_StackFailure(void *,char const *)" (?_RTC_StackFailure@@YAXPEAXPEBD@Z)
1>msvcrtd.lib(error.obj) : error LNK2019: unresolved external symbol strcat_s referenced in function "void __cdecl _RTC_StackFailure(void *,char const *)" (?_RTC_StackFailure@@YAXPEAXPEBD@Z)
1>msvcrtd.lib(error.obj) : error LNK2019: unresolved external symbol __stdio_common_vsprintf_s referenced in function _vsprintf_s_l
1>msvcrtd.lib(error.obj) : error LNK2001: unresolved external symbol __C_specific_handler_noexcept
1>msvcrtd.lib(throw_bad_alloc.obj) : error LNK2019: unresolved external symbol __std_exception_copy referenced in function "public: __cdecl std::exception::exception(class std::exception const &)" (??0exception@std@@QEAA@AEBV01@@Z)
1>msvcrtd.lib(throw_bad_alloc.obj) : error LNK2019: unresolved external symbol __std_exception_destroy referenced in function "public: virtual __cdecl std::exception::~exception(void)" (??1exception@std@@UEAA@XZ)
1>msvcrtd.lib(throw_bad_alloc.obj) : error LNK2019: unresolved external symbol _CxxThrowException referenced in function "void __cdecl __scrt_throw_std_bad_alloc(void)" (?__scrt_throw_std_bad_alloc@@YAXXZ)
1>msvcrtd.lib(delete_scalar.obj) : error LNK2019: unresolved external symbol _free_dbg referenced in function "void __cdecl operator delete(void *)" (??3@YAXPEAX@Z)
1>msvcrtd.lib(tncleanup.obj) : error LNK2019: unresolved external symbol __std_type_info_destroy_list referenced in function "void __cdecl __scrt_uninitialize_type_info(void)" (?__scrt_uninitialize_type_info@@YAXXZ)
1>msvcrtd.lib(utility.obj) : error LNK2019: unresolved external symbol _seh_filter_dll referenced in function __scrt_dllmain_exception_filter
1>msvcrtd.lib(utility.obj) : error LNK2019: unresolved external symbol _configure_narrow_argv referenced in function "public: static int __cdecl __scrt_narrow_argv_policy::configure_argv(void)" (?configure_argv@__scrt_narrow_argv_policy@@SAHXZ)
1>msvcrtd.lib(utility.obj) : error LNK2019: unresolved external symbol _initialize_narrow_environment referenced in function "public: static int __cdecl __scrt_narrow_environment_policy::initialize_environment(void)" (?initialize_environment@__scrt_narrow_environment_policy@@SAHXZ)
1>msvcrtd.lib(utility.obj) : error LNK2019: unresolved external symbol _initialize_onexit_table referenced in function __scrt_initialize_onexit_tables
1>msvcrtd.lib(utility.obj) : error LNK2019: unresolved external symbol _register_onexit_function referenced in function _onexit
1>msvcrtd.lib(utility.obj) : error LNK2019: unresolved external symbol _execute_onexit_table referenced in function __scrt_dllmain_uninitialize_c
1>msvcrtd.lib(utility.obj) : error LNK2019: unresolved external symbol _crt_atexit referenced in function _onexit
1>msvcrtd.lib(utility.obj) : error LNK2019: unresolved external symbol _crt_at_quick_exit referenced in function at_quick_exit
1>msvcrtd.lib(utility.obj) : error LNK2019: unresolved external symbol _cexit referenced in function __scrt_dllmain_uninitialize_c
1>msvcrtd.lib(utility_desktop.obj) : error LNK2019: unresolved external symbol terminate referenced in function __scrt_unhandled_exception_filter
1>msvcrtd.lib(utility_desktop.obj) : error LNK2019: unresolved external symbol __current_exception referenced in function __scrt_unhandled_exception_filter
1>msvcrtd.lib(utility_desktop.obj) : error LNK2019: unresolved external symbol __current_exception_context referenced in function __scrt_unhandled_exception_filter
1>msvcrtd.lib(pdblkup.obj) : error LNK2019: unresolved external symbol _wmakepath_s referenced in function "int __cdecl GetPdbDllPathFromFilePath(wchar_t const *,wchar_t *,unsigned __int64)" (?GetPdbDllPathFromFilePath@@YAHPEB_WPEA_W_K@Z)
1>msvcrtd.lib(pdblkup.obj) : error LNK2019: unresolved external symbol _wsplitpath_s referenced in function "int __cdecl GetPdbDllPathFromFilePath(wchar_t const *,wchar_t *,unsigned __int64)" (?GetPdbDllPathFromFilePath@@YAHPEB_WPEA_W_K@Z)
1>msvcrtd.lib(pdblkup.obj) : error LNK2019: unresolved external symbol wcscpy_s referenced in function "int __cdecl GetPdbDllPathFromFilePath(wchar_t const *,wchar_t *,unsigned __int64)" (?GetPdbDllPathFromFilePath@@YAHPEB_WPEA_W_K@Z)
1>msvcrtd.lib(pdblkup.obj) : error LNK2019: unresolved external symbol __vcrt_GetModuleFileNameW referenced in function "struct HINSTANCE__ * __cdecl GetPdbDll(void)" (?GetPdbDll@@YAPEAUHINSTANCE__@@XZ)
1>msvcrtd.lib(pdblkup.obj) : error LNK2019: unresolved external symbol __vcrt_GetModuleHandleW referenced in function "struct HINSTANCE__ * __cdecl GetPdbDll(void)" (?GetPdbDll@@YAPEAUHINSTANCE__@@XZ)
1>msvcrtd.lib(pdblkup.obj) : error LNK2019: unresolved external symbol __vcrt_LoadLibraryExW referenced in function "struct HINSTANCE__ * __cdecl GetPdbDll(void)" (?GetPdbDll@@YAPEAUHINSTANCE__@@XZ)
1>x64\Debug\WavDest.dll : fatal error LNK1120: 43 unresolved externals
1>Done building project "WavDest.vcxproj" -- FAILED.
========== Rebuild All: 0 succeeded, 1 failed, 0 skipped ==========
========== Rebuild started at 9:46 AM and took 01.927 seconds ==========

지난 글에 쓴 것처럼, 이것은 WavDest 프로젝트가 기본적으로 "Ignore All Default Libraries" == "Yes (/NODEFAULTLIB)" 옵션을 가지고 있기 때문입니다. 따라서 그 글에서처럼 vcruntime.lib, ucrt.lib, libcmt.lib를 추가 지정하거나, 혹은 그냥 간단하게 ^^ "Ignore All Default Libraries" 설정을 "No"로 해주시면 됩니다.




자, 그럼 빌드 후 생성한 dll에 대해 (관리자 권한으로) regsvr32 등록하면, (64비트로 WavDest를 빌드했다면 64비트의 "C:\Program Files (x86)\Windows Kits\10\bin\10.0.22000.0\x64") graphedt.exe를 실행시켜 "Graph", "Insert Filters..." 메뉴를 선택해 "Direct Show Filters" 범주를 통해,

wavdest_1.png

"Wav Dest" 항목을 볼 수 있습니다. ^^




만약 RegSvr32.EXE 실행 시 이런 오류가 발생한다면?

RegSvr32
The module "WavDest.dll" was loaded but the call to DllRegisterServer failed with error code 0x80070005.

For more information about this problem, search online using the error code as a search term.

관리자 권한으로 등록하지 않았기 때문입니다.




[이 글에 대해서 여러분들과 의견을 공유하고 싶습니다. 틀리거나 미흡한 부분 또는 의문 사항이 있으시면 언제든 댓글 남겨주십시오.]







[최초 등록일: ]
[최종 수정일: 10/31/2023]

Creative Commons License
이 저작물은 크리에이티브 커먼즈 코리아 저작자표시-비영리-변경금지 2.0 대한민국 라이센스에 따라 이용하실 수 있습니다.
by SeongTae Jeong, mailto:techsharer at outlook.com

비밀번호

댓글 작성자
 




[1]  2  3  4  5  6  7  8  9  10  11  12  13  14  15  ...
NoWriterDateCnt.TitleFile(s)
13645정성태6/13/2024447개발 환경 구성: 711. Visual Studio로 개발 시 기본 등록하는 dev tag 이미지로 Docker Desktop k8s에서 실행하는 방법
13644정성태6/12/2024488닷넷: 2265. C# - System.Text.Json의 기본적인 (한글 등에서의) escape 처리
13643정성태6/12/2024460오류 유형: 907. MySqlConnector 사용 시 System.IO.FileLoadException 오류
13642정성태6/11/2024492스크립트: 65. 파이썬 - asgi 버전(2, 3)에 따라 달라지는 uvicorn 호스팅
13641정성태6/11/2024504Linux: 71. Ubuntu 20.04를 22.04로 업데이트
13640정성태6/10/2024703Phone: 21. C# MAUI - Android 환경에서의 파일 다운로드(DownloadManager)
13639정성태6/8/2024730오류 유형: 906. C# MAUI - Android Emulator에서 "Waiting For Debugger"로 무한 대기
13638정성태6/8/2024873오류 유형: 905. C# MAUI - 추가한 layout XML 파일이 Resource.Layout 멤버로 나오지 않는 문제
13637정성태6/6/20241029Phone: 20. C# MAUI - 유튜브 동영상을 MediaElement로 재생하는 방법
13636정성태5/30/20241083닷넷: 2264. C# - 형식 인자로 인터페이스를 갖는 제네릭 타입으로의 형변환파일 다운로드1
13635정성태5/29/2024910Phone: 19. C# MAUI - 안드로이드 "Share" 대상으로 등록하는 방법
13634정성태5/24/20241175Phone: 18. C# MAUI - 안드로이드 플랫폼에서의 Activity 제어
13633정성태5/22/20241115스크립트: 64. 파이썬 - ASGI를 만족하는 최소한의 구현 코드
13632정성태5/20/20241230Phone: 17. C# MAUI - Android 내에 Web 서비스 호스팅
13631정성태5/19/20241216Phone: 16. C# MAUI - /Download 등의 공용 디렉터리에 접근하는 방법
13630정성태5/19/20241567닷넷: 2263. C# - Thread가 Task보다 더 빠르다는 어떤 예제(?)
13629정성태5/18/20241394개발 환경 구성: 710. Android - adb.exe를 이용한 파일 전송
13628정성태5/17/20241383개발 환경 구성: 709. Windows - WHPX(Windows Hypervisor Platform)를 이용한 Android Emulator 가속
13627정성태5/17/20241365오류 유형: 904. 파이썬 - UnicodeEncodeError: 'ascii' codec can't encode character '...' in position ...: ordinal not in range(128)
13626정성태5/15/20241488Phone: 15. C# MAUI - MediaElement Source 경로 지정 방법파일 다운로드1
13625정성태5/14/20241762닷넷: 2262. C# - Exception Filter 조건(when)을 갖는 catch 절의 IL 구조
13624정성태5/12/20241951Phone: 14. C# - MAUI에서 MediaElement 사용파일 다운로드1
13623정성태5/11/20242135닷넷: 2261. C# - 구글 OAuth의 JWT (JSON Web Tokens) 해석파일 다운로드1
13622정성태5/10/20242055닷넷: 2260. C# - Google 로그인 연동 (ASP.NET 예제)파일 다운로드1
13621정성태5/10/20242098오류 유형: 903. IISExpress - Failed to register URL "..." for site "..." application "/". Error description: Cannot create a file when that file already exists. (0x800700b7)
[1]  2  3  4  5  6  7  8  9  10  11  12  13  14  15  ...