Microsoft MVP성태의 닷넷 이야기
C/C++: 163. Visual Studio 2022 - DirectShow 예제 컴파일(WAV Dest) [링크 복사], [링크+제목 복사],
조회: 5246
글쓴 사람
정성태 (techsharer at outlook.com)
홈페이지
첨부 파일
 

Visual Studio 2022 - DirectShow 예제 컴파일(WAV Dest)

예전에 소개한,

Realtek 사운드 장치에서 재생되는 오디오를 GraphEditor로 녹음하는 방법
; https://www.sysnet.pe.kr/2/0/1631

WAV Dest 구성요소는 현재 github에서 소스코드를 구할 수 있습니다.

WAV Dest
; https://github.com/microsoft/Windows-classic-samples/tree/main/Samples/Win7Samples/multimedia/directshow/filters/wavdest

원래 저 프로젝트는 Visual Studio 2010용으로 만들어져 있어 현재는 프로젝트 파일을 2022로 마이그레이션을 해야 합니다. (물론, 2022에서 프로젝트를 열면 자동으로 해줍니다.)

이후 빌드하면 이런 에러가 나오는데요,

Rebuild started...
1>------ Rebuild All started: Project: WavDest, Configuration: Debug x64 ------
1>C:\Program Files\Microsoft Visual Studio\2022\Enterprise\MSBuild\Microsoft\VC\v170\Microsoft.Cpp.Analysis.props(24,5): warning MSB4211: The property "MsvcAnalysisPluginPath" is being set to a value for the first time, but it was already consumed at "C:\Program Files\Microsoft Visual Studio\2022\Enterprise\MSBuild\Microsoft\VC\v170\Microsoft.CodeAnalysis.Extensions.props (33,5)".
1>cl : command line  warning D9035: option 'Gm' has been deprecated and will be removed in a future release
1>wavdest.cpp
1>C:\Program Files\Microsoft Visual Studio\2022\Enterprise\MSBuild\Microsoft\VC\v170\Microsoft.CppCommon.targets(1096,5): error MSB6006: "link.exe" exited with code 1104.
1>LINK : fatal error LNK1104: cannot open file 'strmbasd.lib'
1>Done building project "WavDest.vcxproj" -- FAILED.
========== Rebuild All: 0 succeeded, 1 failed, 0 skipped ==========
========== Rebuild started at 9:42 AM and took 02.792 seconds ==========

프로젝트를 보면,

<AdditionalDependencies>..\..\BaseClasses\Debug\strmbasd.lib;winmm.lib;msvcrtd.lib;%(AdditionalDependencies)</AdditionalDependencies>

".\Windows-classic-samples\Samples\Win7Samples\multimedia\directshow\baseclasses" 프로젝트에 대한 의존성이 걸려 있으므로 baseclasses 프로젝트를 먼저 빌드해야 합니다. 이후 다시 WavDest를 빌드하면 여전히 오류가 발생하는데요,

Rebuild started...
1>------ Rebuild All started: Project: WavDest, Configuration: Debug x64 ------
1>C:\Program Files\Microsoft Visual Studio\2022\Enterprise\MSBuild\Microsoft\VC\v170\Microsoft.Cpp.Analysis.props(24,5): warning MSB4211: The property "MsvcAnalysisPluginPath" is being set to a value for the first time, but it was already consumed at "C:\Program Files\Microsoft Visual Studio\2022\Enterprise\MSBuild\Microsoft\VC\v170\Microsoft.CodeAnalysis.Extensions.props (33,5)".
1>cl : command line  warning D9035: option 'Gm' has been deprecated and will be removed in a future release
1>wavdest.cpp
1>   Creating library x64\Debug\WavDest.lib and object x64\Debug\WavDest.exp
1>strmbasd.lib(amfilter.obj) : error LNK2019: unresolved external symbol memcmp referenced in function "public: virtual long __cdecl CMediaSample::SetMediaType(struct _AMMediaType *)" (?SetMediaType@CMediaSample@@UEAAJPEAU_AMMediaType@@@Z)
1>strmbasd.lib(transfrm.obj) : error LNK2001: unresolved external symbol memcmp
1>strmbasd.lib(dllentry.obj) : error LNK2001: unresolved external symbol memcmp
1>strmbasd.lib(amvideo.obj) : error LNK2001: unresolved external symbol memcmp
1>wavdest.obj : error LNK2001: unresolved external symbol memcmp
1>strmbasd.lib(wxdebug.obj) : error LNK2001: unresolved external symbol memcmp
1>strmbasd.lib(combase.obj) : error LNK2001: unresolved external symbol memcmp
1>strmbasd.lib(mtype.obj) : error LNK2001: unresolved external symbol memcmp
1>wavdest.obj : error LNK2019: unresolved external symbol memcpy referenced in function "public: virtual long __cdecl CWavDestFilter::StopStreaming(void)" (?StopStreaming@CWavDestFilter@@UEAAJXZ)
1>strmbasd.lib(wxutil.obj) : error LNK2001: unresolved external symbol memcpy
1>strmbasd.lib(mtype.obj) : error LNK2001: unresolved external symbol memcpy
1>strmbasd.lib(amfilter.obj) : error LNK2001: unresolved external symbol memcpy
1>wavdest.obj : error LNK2019: unresolved external symbol memset referenced in function "public: virtual long __cdecl CWavDestFilter::StopStreaming(void)" (?StopStreaming@CWavDestFilter@@UEAAJXZ)
1>strmbasd.lib(mtype.obj) : error LNK2001: unresolved external symbol memset
1>strmbasd.lib(amfilter.obj) : error LNK2001: unresolved external symbol memset
1>msvcrtd.lib(gshandlereh4.obj) : error LNK2001: unresolved external symbol __CxxFrameHandler4
1>strmbasd.lib(mtype.obj) : error LNK2001: unresolved external symbol __CxxFrameHandler4
1>strmbasd.lib(amfilter.obj) : error LNK2001: unresolved external symbol __CxxFrameHandler4
1>strmbasd.lib(transfrm.obj) : error LNK2001: unresolved external symbol __CxxFrameHandler4
1>strmbasd.lib(wxlist.obj) : error LNK2001: unresolved external symbol __CxxFrameHandler4
1>wavdest.obj : error LNK2001: unresolved external symbol __CxxFrameHandler4
1>strmbasd.lib(wxdebug.obj) : error LNK2001: unresolved external symbol __CxxFrameHandler4
1>strmbasd.lib(wxutil.obj) : error LNK2001: unresolved external symbol __CxxFrameHandler4
1>strmbasd.lib(combase.obj) : error LNK2001: unresolved external symbol __CxxFrameHandler4
1>strmbasd.lib(wxdebug.obj) : error LNK2019: unresolved external symbol wcsrchr referenced in function "wchar_t * __cdecl wcsrchr(wchar_t *,wchar_t)" (?wcsrchr@@YAPEA_WPEA_W_W@Z)
1>strmbasd.lib(dllentry.obj) : error LNK2001: unresolved external symbol wcsrchr
1>  Hint on symbols that are defined and could potentially match:
1>    "wchar_t * __cdecl wcsrchr(wchar_t *,wchar_t)" (?wcsrchr@@YAPEA_WPEA_W_W@Z)
1>strmbasd.lib(wxdebug.obj) : error LNK2019: unresolved external symbol __imp___stdio_common_vswprintf referenced in function _vsnwprintf_l
1>strmbasd.lib(wxutil.obj) : error LNK2001: unresolved external symbol __imp___stdio_common_vswprintf
1>strmbasd.lib(dllsetup.obj) : error LNK2001: unresolved external symbol __imp___stdio_common_vswprintf
1>strmbasd.lib(dllentry.obj) : error LNK2001: unresolved external symbol __imp___stdio_common_vswprintf
1>strmbasd.lib(wxdebug.obj) : error LNK2019: unresolved external symbol __imp___stdio_common_vsprintf referenced in function _vsnprintf_l
1>strmbasd.lib(wxutil.obj) : error LNK2019: unresolved external symbol memmove referenced in function memmoveInternal
1>strmbasd.lib(amfilter.obj) : error LNK2001: unresolved external symbol _purecall
1>msvcrtd.lib(new_scalar.obj) : error LNK2019: unresolved external symbol _callnewh referenced in function "void * __cdecl operator new(unsigned __int64)" (??2@YAPEAX_K@Z)
1>msvcrtd.lib(new_scalar.obj) : error LNK2019: unresolved external symbol malloc referenced in function "void * __cdecl operator new(unsigned __int64)" (??2@YAPEAX_K@Z)
1>msvcrtd.lib(init.obj) : error LNK2019: unresolved external symbol _CrtDbgReport referenced in function _CRT_RTC_INIT
1>msvcrtd.lib(init.obj) : error LNK2019: unresolved external symbol _CrtDbgReportW referenced in function _CRT_RTC_INITW
1>msvcrtd.lib(dll_dllmain.obj) : error LNK2019: unresolved external symbol _initterm referenced in function "int __cdecl dllmain_crt_process_attach(struct HINSTANCE__ * const,void * const)" (?dllmain_crt_process_attach@@YAHQEAUHINSTANCE__@@QEAX@Z)
1>msvcrtd.lib(dll_dllmain.obj) : error LNK2019: unresolved external symbol _initterm_e referenced in function "int __cdecl dllmain_crt_process_attach(struct HINSTANCE__ * const,void * const)" (?dllmain_crt_process_attach@@YAHQEAUHINSTANCE__@@QEAX@Z)
1>msvcrtd.lib(dll_dllmain.obj) : error LNK2001: unresolved external symbol __C_specific_handler
1>msvcrtd.lib(utility.obj) : error LNK2001: unresolved external symbol __C_specific_handler
1>msvcrtd.lib(error.obj) : error LNK2019: unresolved external symbol strcpy_s referenced in function "void __cdecl _RTC_StackFailure(void *,char const *)" (?_RTC_StackFailure@@YAXPEAXPEBD@Z)
1>msvcrtd.lib(error.obj) : error LNK2019: unresolved external symbol strcat_s referenced in function "void __cdecl _RTC_StackFailure(void *,char const *)" (?_RTC_StackFailure@@YAXPEAXPEBD@Z)
1>msvcrtd.lib(error.obj) : error LNK2019: unresolved external symbol __stdio_common_vsprintf_s referenced in function _vsprintf_s_l
1>msvcrtd.lib(error.obj) : error LNK2001: unresolved external symbol __C_specific_handler_noexcept
1>msvcrtd.lib(throw_bad_alloc.obj) : error LNK2019: unresolved external symbol __std_exception_copy referenced in function "public: __cdecl std::exception::exception(class std::exception const &)" (??0exception@std@@QEAA@AEBV01@@Z)
1>msvcrtd.lib(throw_bad_alloc.obj) : error LNK2019: unresolved external symbol __std_exception_destroy referenced in function "public: virtual __cdecl std::exception::~exception(void)" (??1exception@std@@UEAA@XZ)
1>msvcrtd.lib(throw_bad_alloc.obj) : error LNK2019: unresolved external symbol _CxxThrowException referenced in function "void __cdecl __scrt_throw_std_bad_alloc(void)" (?__scrt_throw_std_bad_alloc@@YAXXZ)
1>msvcrtd.lib(delete_scalar.obj) : error LNK2019: unresolved external symbol _free_dbg referenced in function "void __cdecl operator delete(void *)" (??3@YAXPEAX@Z)
1>msvcrtd.lib(tncleanup.obj) : error LNK2019: unresolved external symbol __std_type_info_destroy_list referenced in function "void __cdecl __scrt_uninitialize_type_info(void)" (?__scrt_uninitialize_type_info@@YAXXZ)
1>msvcrtd.lib(utility.obj) : error LNK2019: unresolved external symbol _seh_filter_dll referenced in function __scrt_dllmain_exception_filter
1>msvcrtd.lib(utility.obj) : error LNK2019: unresolved external symbol _configure_narrow_argv referenced in function "public: static int __cdecl __scrt_narrow_argv_policy::configure_argv(void)" (?configure_argv@__scrt_narrow_argv_policy@@SAHXZ)
1>msvcrtd.lib(utility.obj) : error LNK2019: unresolved external symbol _initialize_narrow_environment referenced in function "public: static int __cdecl __scrt_narrow_environment_policy::initialize_environment(void)" (?initialize_environment@__scrt_narrow_environment_policy@@SAHXZ)
1>msvcrtd.lib(utility.obj) : error LNK2019: unresolved external symbol _initialize_onexit_table referenced in function __scrt_initialize_onexit_tables
1>msvcrtd.lib(utility.obj) : error LNK2019: unresolved external symbol _register_onexit_function referenced in function _onexit
1>msvcrtd.lib(utility.obj) : error LNK2019: unresolved external symbol _execute_onexit_table referenced in function __scrt_dllmain_uninitialize_c
1>msvcrtd.lib(utility.obj) : error LNK2019: unresolved external symbol _crt_atexit referenced in function _onexit
1>msvcrtd.lib(utility.obj) : error LNK2019: unresolved external symbol _crt_at_quick_exit referenced in function at_quick_exit
1>msvcrtd.lib(utility.obj) : error LNK2019: unresolved external symbol _cexit referenced in function __scrt_dllmain_uninitialize_c
1>msvcrtd.lib(utility_desktop.obj) : error LNK2019: unresolved external symbol terminate referenced in function __scrt_unhandled_exception_filter
1>msvcrtd.lib(utility_desktop.obj) : error LNK2019: unresolved external symbol __current_exception referenced in function __scrt_unhandled_exception_filter
1>msvcrtd.lib(utility_desktop.obj) : error LNK2019: unresolved external symbol __current_exception_context referenced in function __scrt_unhandled_exception_filter
1>msvcrtd.lib(pdblkup.obj) : error LNK2019: unresolved external symbol _wmakepath_s referenced in function "int __cdecl GetPdbDllPathFromFilePath(wchar_t const *,wchar_t *,unsigned __int64)" (?GetPdbDllPathFromFilePath@@YAHPEB_WPEA_W_K@Z)
1>msvcrtd.lib(pdblkup.obj) : error LNK2019: unresolved external symbol _wsplitpath_s referenced in function "int __cdecl GetPdbDllPathFromFilePath(wchar_t const *,wchar_t *,unsigned __int64)" (?GetPdbDllPathFromFilePath@@YAHPEB_WPEA_W_K@Z)
1>msvcrtd.lib(pdblkup.obj) : error LNK2019: unresolved external symbol wcscpy_s referenced in function "int __cdecl GetPdbDllPathFromFilePath(wchar_t const *,wchar_t *,unsigned __int64)" (?GetPdbDllPathFromFilePath@@YAHPEB_WPEA_W_K@Z)
1>msvcrtd.lib(pdblkup.obj) : error LNK2019: unresolved external symbol __vcrt_GetModuleFileNameW referenced in function "struct HINSTANCE__ * __cdecl GetPdbDll(void)" (?GetPdbDll@@YAPEAUHINSTANCE__@@XZ)
1>msvcrtd.lib(pdblkup.obj) : error LNK2019: unresolved external symbol __vcrt_GetModuleHandleW referenced in function "struct HINSTANCE__ * __cdecl GetPdbDll(void)" (?GetPdbDll@@YAPEAUHINSTANCE__@@XZ)
1>msvcrtd.lib(pdblkup.obj) : error LNK2019: unresolved external symbol __vcrt_LoadLibraryExW referenced in function "struct HINSTANCE__ * __cdecl GetPdbDll(void)" (?GetPdbDll@@YAPEAUHINSTANCE__@@XZ)
1>x64\Debug\WavDest.dll : fatal error LNK1120: 43 unresolved externals
1>Done building project "WavDest.vcxproj" -- FAILED.
========== Rebuild All: 0 succeeded, 1 failed, 0 skipped ==========
========== Rebuild started at 9:46 AM and took 01.927 seconds ==========

지난 글에 쓴 것처럼, 이것은 WavDest 프로젝트가 기본적으로 "Ignore All Default Libraries" == "Yes (/NODEFAULTLIB)" 옵션을 가지고 있기 때문입니다. 따라서 그 글에서처럼 vcruntime.lib, ucrt.lib, libcmt.lib를 추가 지정하거나, 혹은 그냥 간단하게 ^^ "Ignore All Default Libraries" 설정을 "No"로 해주시면 됩니다.




자, 그럼 빌드 후 생성한 dll에 대해 (관리자 권한으로) regsvr32 등록하면, (64비트로 WavDest를 빌드했다면 64비트의 "C:\Program Files (x86)\Windows Kits\10\bin\10.0.22000.0\x64") graphedt.exe를 실행시켜 "Graph", "Insert Filters..." 메뉴를 선택해 "Direct Show Filters" 범주를 통해,

wavdest_1.png

"Wav Dest" 항목을 볼 수 있습니다. ^^




만약 RegSvr32.EXE 실행 시 이런 오류가 발생한다면?

RegSvr32
The module "WavDest.dll" was loaded but the call to DllRegisterServer failed with error code 0x80070005.

For more information about this problem, search online using the error code as a search term.

관리자 권한으로 등록하지 않았기 때문입니다.




[이 글에 대해서 여러분들과 의견을 공유하고 싶습니다. 틀리거나 미흡한 부분 또는 의문 사항이 있으시면 언제든 댓글 남겨주십시오.]







[최초 등록일: ]
[최종 수정일: 10/31/2023]

Creative Commons License
이 저작물은 크리에이티브 커먼즈 코리아 저작자표시-비영리-변경금지 2.0 대한민국 라이센스에 따라 이용하실 수 있습니다.
by SeongTae Jeong, mailto:techsharer at outlook.com

비밀번호

댓글 작성자
 




1  2  3  4  5  6  7  8  9  10  11  12  [13]  14  15  ...
NoWriterDateCnt.TitleFile(s)
13348정성태5/10/20234562.NET Framework: 2119. C# - Semantic Kernel의 "Basic Loading of the Kernel" 예제
13347정성태5/10/20234902.NET Framework: 2118. C# - Semantic Kernel의 Prompt chaining 예제파일 다운로드1
13346정성태5/10/20234746오류 유형: 858. RDP 원격 환경과 로컬 PC 간의 Ctrl+C, Ctrl+V 복사가 안 되는 문제
13345정성태5/9/20236482.NET Framework: 2117. C# - (OpenAI 기반의) Microsoft Semantic Kernel을 이용한 자연어 처리 [1]파일 다운로드1
13344정성태5/9/20237349.NET Framework: 2116. C# - OpenAI API 사용 - 지원 모델 목록 [1]파일 다운로드1
13343정성태5/9/20235171디버깅 기술: 192. Windbg - Hyper-V VM으로 이더넷 원격 디버깅 연결하는 방법
13342정성태5/8/20234995.NET Framework: 2115. System.Text.Json의 역직렬화 시 필드/속성 주의
13341정성태5/8/20234792닷넷: 2114. C# 12 - 모든 형식의 별칭(Using aliases for any type)
13340정성태5/8/20234966오류 유형: 857. Microsoft.Data.SqlClient.SqlException - 0x80131904
13339정성태5/6/20235786닷넷: 2113. C# 12 - 기본 생성자(Primary Constructors)
13338정성태5/6/20235052닷넷: 2112. C# 12 - 기본 람다 매개 변수파일 다운로드1
13337정성태5/5/20235607Linux: 59. dockerfile - docker exec로 container에 접속 시 자동으로 실행되는 코드 적용
13336정성태5/4/20235429.NET Framework: 2111. C# - 바이너리 출력 디렉터리와 연관된 csproj 설정
13335정성태4/30/20235538.NET Framework: 2110. C# - FFmpeg.AutoGen 라이브러리를 이용한 기본 프로젝트 구성 - Windows Forms파일 다운로드1
13334정성태4/29/20235076Windows: 250. Win32 C/C++ - Modal 메시지 루프 내에서 SetWindowsHookEx를 이용한 Thread 메시지 처리 방법
13333정성태4/28/20234602Windows: 249. Win32 C/C++ - 대화창 템플릿을 런타임에 코딩해서 사용파일 다운로드1
13332정성태4/27/20234514Windows: 248. Win32 C/C++ - 대화창을 위한 메시지 루프 사용자 정의파일 다운로드1
13331정성태4/27/20234483오류 유형: 856. dockerfile - 구 버전의 .NET Core 이미지 사용 시 apt update 오류
13330정성태4/26/20234290Windows: 247. Win32 C/C++ - CS_GLOBALCLASS 설명
13329정성태4/24/20234548Windows: 246. Win32 C/C++ - 직접 띄운 대화창 템플릿을 위한 Modal 메시지 루프 생성파일 다운로드1
13328정성태4/19/20234160VS.NET IDE: 184. Visual Studio - Fine Code Coverage에서 동작하지 않는 Fake/Shim 테스트
13327정성태4/19/20234475VS.NET IDE: 183. C# - .NET Core/5+ 환경에서 Fakes를 이용한 단위 테스트 방법
13326정성태4/18/20236168.NET Framework: 2109. C# - 닷넷 응용 프로그램에서 SQLite 사용 (System.Data.SQLite) [1]파일 다운로드1
13325정성태4/18/20235281스크립트: 48. 파이썬 - PostgreSQL의 with 문을 사용한 경우 연결 개체 누수
13324정성태4/17/20235162.NET Framework: 2108. C# - Octave의 "save -binary ..."로 생성한 바이너리 파일 분석파일 다운로드1
13323정성태4/16/20235061개발 환경 구성: 677. Octave에서 Excel read/write를 위한 io 패키지 설치
1  2  3  4  5  6  7  8  9  10  11  12  [13]  14  15  ...