Microsoft MVP성태의 닷넷 이야기
글쓴 사람
정성태 (techsharer at outlook.com)
홈페이지
첨부 파일
 

electronize - User Profile 디렉터리에 공백 문자가 있는 경우 빌드가 실패하는 문제

예를 들어, 윈도우의 사용자 이름이 "Default User"라고 가정해보겠습니다. 이런 경우라면 %USERPROFILE%이나 %LOCALAPPDATA%, %APPDATA% 등의 경로에 공백이 포함됩니다.

C:\temp> echo %USERPROFILE%
C:\Users\Default User

C:\temp> echo %LOCALAPPDATA%
C:\Users\Default User\AppData\Local

C:\temp> echo %APPDATA%
C:\Users\Default User\AppData\Roaming

이 상태에서 electronize로 빌드 시,

electronize build /target win-x64 /PublishReadyToRun false

다음과 같은 식의 오류가 발생하는데,

Error: EEXIST: file already exists, mkdir 'C:\Users\Default'
TypeError: Cannot read property 'loaded' of undefined
    at exit (C:\Program Files\nodejs\node_modules\npm\lib\utils\error-handler.js:98:27)
    at errorHandler (C:\Program Files\nodejs\node_modules\npm\lib\utils\error-handler.js:216:3)
    at C:\Program Files\nodejs\node_modules\npm\bin\npm-cli.js:77:20
    at cb (C:\Program Files\nodejs\node_modules\npm\lib\npm.js:225:22)
    at C:\Program Files\nodejs\node_modules\npm\lib\npm.js:263:24
    at C:\Program Files\nodejs\node_modules\npm\lib\config\core.js:83:7
    at Array.forEach (<anonymous>)
    at C:\Program Files\nodejs\node_modules\npm\lib\config\core.js:82:13
    at f (C:\Program Files\nodejs\node_modules\npm\node_modules\once\once.js:25:25)
    at afterExtras (C:\Program Files\nodejs\node_modules\npm\lib\config\core.js:173:20)
C:\Program Files\nodejs\node_modules\npm\lib\utils\error-handler.js:98
  var doExit = npm.config.loaded ? npm.config.get('_exit') : true
                          ^
TypeError: Cannot read property 'loaded' of undefined
    at exit (C:\Program Files\nodejs\node_modules\npm\lib\utils\error-handler.js:98:27)
    at process.errorHandler (C:\Program Files\nodejs\node_modules\npm\lib\utils\error-handler.js:216:3)
    at process.emit (events.js:198:13)
    at process._fatalException (internal/bootstrap/node.js:496:27)
Install for electron-builder@latest failed with code 7
F:\cloud_drive\Dropbox\articles\elec_net\kestrel_razor_sample\ConsoleApp1\obj\desktop\win-x64>
... done

npm ERR! code ENOLOCAL
npm ERR! Could not install from "User\AppData\Roaming\npm-cache\_npx\16672" as it does not contain a package.json file.
npm ERR! A complete log of this run can be found in:
npm ERR!     C:\Users\Default User\AppData\Roaming\npm-cache\_logs\2021-01-27T05_21_25_321Z-debug.log
Install for electron-builder@latest failed with code 1

출력에 나온 log 파일을 보면 node.exe에 전달된 경로가 이렇게 해석된 것을 확인할 수 있습니다.

0 info it worked if it ends with ok
1 verbose cli [ 'C:\\Program Files\\nodejs\\node.exe',
1 verbose cli   'C:\\Program Files\\nodejs\\node_modules\\npm\\bin\\npm-cli.js',
1 verbose cli   'install',
1 verbose cli   'electron-builder@latest',
1 verbose cli   '--global',
1 verbose cli   '--prefix',
1 verbose cli   'C:\\Users\\Default',
1 verbose cli   'User\\AppData\\Roaming\\npm-cache\\_npx\\16672',
1 verbose cli   '--loglevel',
1 verbose cli   'error',
1 verbose cli   '--json' ]
...[생략]...

원인을 유추해 보면, 저 경로는 "%APPDATA%" 경로에 포함된 공백이 명령행 인자에서 2개로 나눠져 인식이 되었기 때문입니다.




이에 대한 근본적인 원인을 해결하려면 저렇게 실행하는 코드를 수정해야 합니다. 가령 node.exe를 실행할 때 전달하는 %APPDATA%에 대한 경로를 다음과 같은 식으로 인용부호로 묶어 전달해야 합니다.

c:\temp> node.exe "C:\Users\Default User\AppData\Roaming\npm-cache\_npx\16672" ...[생략]...

따라서 이러한 버그를 수정해 달라는 이슈를 생성하거나, 아니면 직접 소스 코드를 고쳐 빌드하는 수 밖에는 없습니다.




한 가지 다행이라면, 이렇게 경로에 '공백 문자'가 있는 경우 8.3 형식의 경로를 사용해 표현하는 것이 가능하다는 점입니다.

Windows - 도스 시절의 8.3 경로를 알아내는 방법
; https://www.sysnet.pe.kr/2/0/12511

가령, 이런 경우 electronize는 내부에서 "C:\Users\Default User\AppData\Roaming\npm-cache\_npx\21340"라는 경로를 아마도 다음과 같은 식으로 구했을 것입니다.

string path = GetEnvrionmentVairable("APPDATA"); // C:\Users\Default User\AppData\Roaming
string arg1 = path + "\npm-cache\_npx\16672";

따라서 환경 변수로 설정된 LOCALAPPDATA나, APPDATA에 대해 같은 경로로 대우받는 8.3 형식으로 명시하면 됩니다.

SET LOCALAPPDATA=C:\Users\DEFAULT~1\AppData\Local
SET APPDATA=C:\Users\DEFAULT~1\AppData\Roaming

이때 사용자 계정으로 등록된 "Default User"의 8.3 이름은 다음과 같은 명령어로 간단하게 구할 수 있습니다.

C:\temp> dir /X "%USERPROFILE%\.."
 Volume in drive C has no label.
 Volume Serial Number is C02C-196F

 Directory of C:\Users

2021-01-27  오후 02:33    <DIR>                       .
2021-01-27  오후 02:33    <DIR>                       ..
2020-12-24  오후 08:17    <DIR>          DEFAUL~1     Default User
2021-01-22  오후 07:42    <DIR>          MSSQLS~1     MSSQLSERVER
2020-12-03  오전 11:02    <DIR>          RDVGRA~1     RDV GRAPHICS SERVICE
2021-01-22  오후 07:42    <DIR>          SQLTEL~1     SQLTELEMETRY
               0 File(s)              0 bytes
               6 Dir(s)  50,487,128,064 bytes free

명령행에서 이렇게 설정하고 다시 문제가 되었던 빌드 명령을 수행하면,

c:\temp> SET LOCALAPPDATA=C:\Users\DEFAULT~1\AppData\Local
c:\temp> SET APPDATA=C:\Users\DEFAULT~1\AppData\Roaming

c:\temp> electronize build /target win-x64 /PublishReadyToRun false

정상적으로 실행이 되는 것을 확인할 수 있습니다.




[이 글에 대해서 여러분들과 의견을 공유하고 싶습니다. 틀리거나 미흡한 부분 또는 의문 사항이 있으시면 언제든 댓글 남겨주십시오.]



donaricano-btn



[최초 등록일: ]
[최종 수정일: 1/28/2021 ]

Creative Commons License
이 저작물은 크리에이티브 커먼즈 코리아 저작자표시-비영리-변경금지 2.0 대한민국 라이센스에 따라 이용하실 수 있습니다.
by SeongTae Jeong, mailto:techsharer at outlook.com

비밀번호

댓글 쓴 사람
 




1  2  3  [4]  5  6  7  8  9  10  11  12  13  14  15  ...
NoWriterDateCnt.TitleFile(s)
12567정성태4/9/2021287개발 환경 구성: 553. Docker Desktop for Windows를 위한 k8s 대시보드 활성화 [1]
12566정성태3/24/2021245개발 환경 구성: 552. Kubernetes - kube-apiserver와 REST API 통신하는 방법 (Docker Desktop for Windows 환경)
12565정성태3/17/2021148오류 유형: 704. curl.exe 실행 시 dll not found 오류
12564정성태3/16/2021195VS.NET IDE: 160. 새 프로젝트 창에 C++/CLI 프로젝트 템플릿이 없는 경우
12563정성태3/16/2021172개발 환경 구성: 551. C# - JIRA REST API 사용 정리 (3) jira-oauth-cli 도구를 이용한 키 관리
12562정성태3/16/2021290개발 환경 구성: 550. C# - JIRA REST API 사용 정리 (2) JIRA OAuth 토큰으로 API 사용하는 방법파일 다운로드1
12561정성태3/12/2021244VS.NET IDE: 159. Visual Studio에서 개행(\n, \r) 등의 제어 문자를 치환하는 방법 - 정규 표현식 사용
12560정성태3/12/2021233개발 환경 구성: 549. ssh-keygen으로 생성한 개인키/공개키 파일을 각각 PKCS8/PEM 형식으로 변환하는 방법
12559정성태3/28/2021220.NET Framework: 1028. 닷넷 5 환경의 Web API에 OpenAPI 적용을 위한 NSwag 또는 Swashbuckle 패키지 사용파일 다운로드1
12558정성태3/28/2021357Windows: 192. Power Automate Desktop (Preview) 소개 - Bitvise SSH Client 제어 [1]
12557정성태3/28/2021135Windows: 191. 탐색기의 보안 탭에 있는 "Object name" 경로에 LEFT-TO-RIGHT EMBEDDING 제어 문자가 포함되는 문제
12556정성태3/9/2021110오류 유형: 703. PowerShell ISE의 Debug / Toggle Breakpoint 메뉴가 비활성 상태인 경우
12555정성태3/28/2021255Windows: 190. C# - 레지스트리에 등록된 DigitalProductId로부터 라이선스 키(Product Key)를 알아내는 방법파일 다운로드2
12554정성태3/28/2021276.NET Framework: 1027. 닷넷 응용 프로그램을 위한 PDB 옵션 - full, pdbonly, portable, embedded
12553정성태3/5/2021325개발 환경 구성: 548. 기존 .NET Framework 프로젝트를 .NET Core 용으로 변환해 주는 upgrade-assistant, try-convert 도구 소개
12552정성태3/5/2021207개발 환경 구성: 547. github workflow/actions에서 Visual Studio Marketplace 패키지 등록하는 방법
12551정성태3/5/2021238오류 유형: 702. 비주얼 스튜디오 - The 'CascadePackage' package did not load correctly. (2)
12550정성태3/5/2021198오류 유형: 701. Live Share 1.0.3713.0 버전을 1.0.3884.0으로 업데이트 이후 ContactServiceModelPackage 오류 발생하는 문제
12549정성태3/4/2021216오류 유형: 700. VsixPublisher를 이용한 등록 시 다양한 오류 유형 해결책
12548정성태3/4/2021246개발 환경 구성: 546. github workflow/actions에서 nuget 패키지 등록하는 방법
12547정성태3/3/2021292오류 유형: 699. 비주얼 스튜디오 - The 'CascadePackage' package did not load correctly.
12546정성태3/3/2021255개발 환경 구성: 545. github workflow/actions에서 빌드시 snk 파일 다루는 방법 - Encrypted secrets
12545정성태3/28/2021795.NET Framework: 1026. 닷넷 5에 추가된 POH (Pinned Object Heap) [7]
12544정성태3/28/2021480.NET Framework: 1025. C# - Control의 Invalidate, Update, Refresh 차이점 [2]
12543정성태3/12/2021397VS.NET IDE: 158. C# - 디자인 타임(design-time)과 런타임(runtime)의 코드 실행 구분
12542정성태3/3/2021443개발 환경 구성: 544. github repo의 Release 활성화 및 Actions를 이용한 자동화 방법
1  2  3  [4]  5  6  7  8  9  10  11  12  13  14  15  ...