Microsoft MVP성태의 닷넷 이야기
글쓴 사람
정성태 (techsharer at outlook.com)
홈페이지
첨부 파일
 

electronize - User Profile 디렉터리에 공백 문자가 있는 경우 빌드가 실패하는 문제

예를 들어, 윈도우의 사용자 이름이 "Default User"라고 가정해보겠습니다. 이런 경우라면 %USERPROFILE%이나 %LOCALAPPDATA%, %APPDATA% 등의 경로에 공백이 포함됩니다.

C:\temp> echo %USERPROFILE%
C:\Users\Default User

C:\temp> echo %LOCALAPPDATA%
C:\Users\Default User\AppData\Local

C:\temp> echo %APPDATA%
C:\Users\Default User\AppData\Roaming

이 상태에서 electronize로 빌드 시,

electronize build /target win-x64 /PublishReadyToRun false

다음과 같은 식의 오류가 발생하는데,

Error: EEXIST: file already exists, mkdir 'C:\Users\Default'
TypeError: Cannot read property 'loaded' of undefined
    at exit (C:\Program Files\nodejs\node_modules\npm\lib\utils\error-handler.js:98:27)
    at errorHandler (C:\Program Files\nodejs\node_modules\npm\lib\utils\error-handler.js:216:3)
    at C:\Program Files\nodejs\node_modules\npm\bin\npm-cli.js:77:20
    at cb (C:\Program Files\nodejs\node_modules\npm\lib\npm.js:225:22)
    at C:\Program Files\nodejs\node_modules\npm\lib\npm.js:263:24
    at C:\Program Files\nodejs\node_modules\npm\lib\config\core.js:83:7
    at Array.forEach (<anonymous>)
    at C:\Program Files\nodejs\node_modules\npm\lib\config\core.js:82:13
    at f (C:\Program Files\nodejs\node_modules\npm\node_modules\once\once.js:25:25)
    at afterExtras (C:\Program Files\nodejs\node_modules\npm\lib\config\core.js:173:20)
C:\Program Files\nodejs\node_modules\npm\lib\utils\error-handler.js:98
  var doExit = npm.config.loaded ? npm.config.get('_exit') : true
                          ^
TypeError: Cannot read property 'loaded' of undefined
    at exit (C:\Program Files\nodejs\node_modules\npm\lib\utils\error-handler.js:98:27)
    at process.errorHandler (C:\Program Files\nodejs\node_modules\npm\lib\utils\error-handler.js:216:3)
    at process.emit (events.js:198:13)
    at process._fatalException (internal/bootstrap/node.js:496:27)
Install for electron-builder@latest failed with code 7
F:\cloud_drive\Dropbox\articles\elec_net\kestrel_razor_sample\ConsoleApp1\obj\desktop\win-x64>
... done

npm ERR! code ENOLOCAL
npm ERR! Could not install from "User\AppData\Roaming\npm-cache\_npx\16672" as it does not contain a package.json file.
npm ERR! A complete log of this run can be found in:
npm ERR!     C:\Users\Default User\AppData\Roaming\npm-cache\_logs\2021-01-27T05_21_25_321Z-debug.log
Install for electron-builder@latest failed with code 1

출력에 나온 log 파일을 보면 node.exe에 전달된 경로가 이렇게 해석된 것을 확인할 수 있습니다.

0 info it worked if it ends with ok
1 verbose cli [ 'C:\\Program Files\\nodejs\\node.exe',
1 verbose cli   'C:\\Program Files\\nodejs\\node_modules\\npm\\bin\\npm-cli.js',
1 verbose cli   'install',
1 verbose cli   'electron-builder@latest',
1 verbose cli   '--global',
1 verbose cli   '--prefix',
1 verbose cli   'C:\\Users\\Default',
1 verbose cli   'User\\AppData\\Roaming\\npm-cache\\_npx\\16672',
1 verbose cli   '--loglevel',
1 verbose cli   'error',
1 verbose cli   '--json' ]
...[생략]...

원인을 유추해 보면, 저 경로는 "%APPDATA%" 경로에 포함된 공백이 명령행 인자에서 2개로 나눠져 인식이 되었기 때문입니다.




이에 대한 근본적인 원인을 해결하려면 저렇게 실행하는 코드를 수정해야 합니다. 가령 node.exe를 실행할 때 전달하는 %APPDATA%에 대한 경로를 다음과 같은 식으로 인용 부호로 묶어 전달해야 합니다.

c:\temp> node.exe "C:\Users\Default User\AppData\Roaming\npm-cache\_npx\16672" ...[생략]...

따라서 이러한 버그를 수정해 달라는 이슈를 생성하거나, 아니면 직접 소스 코드를 고쳐 빌드하는 수 밖에는 없습니다.




한 가지 다행이라면, 이렇게 경로에 '공백 문자'가 있는 경우 8.3 형식의 경로를 사용해 표현하는 것이 가능하다는 점입니다.

Windows - 도스 시절의 8.3 경로를 알아내는 방법
; https://www.sysnet.pe.kr/2/0/12511

가령, 이런 경우 electronize는 내부에서 "C:\Users\Default User\AppData\Roaming\npm-cache\_npx\21340"라는 경로를 아마도 다음과 같은 식으로 구했을 것입니다.

string path = GetEnvrionmentVairable("APPDATA"); // C:\Users\Default User\AppData\Roaming
string arg1 = path + "\npm-cache\_npx\16672";

따라서 환경 변수로 설정된 LOCALAPPDATA나, APPDATA에 대해 같은 경로로 대우받는 8.3 형식으로 명시하면 됩니다.

SET LOCALAPPDATA=C:\Users\DEFAULT~1\AppData\Local
SET APPDATA=C:\Users\DEFAULT~1\AppData\Roaming

이때 사용자 계정으로 등록된 "Default User"의 8.3 이름은 다음과 같은 명령어로 간단하게 구할 수 있습니다.

C:\temp> dir /X "%USERPROFILE%\.."
 Volume in drive C has no label.
 Volume Serial Number is C02C-196F

 Directory of C:\Users

2021-01-27  오후 02:33    <DIR>                       .
2021-01-27  오후 02:33    <DIR>                       ..
2020-12-24  오후 08:17    <DIR>          DEFAUL~1     Default User
2021-01-22  오후 07:42    <DIR>          MSSQLS~1     MSSQLSERVER
2020-12-03  오전 11:02    <DIR>          RDVGRA~1     RDV GRAPHICS SERVICE
2021-01-22  오후 07:42    <DIR>          SQLTEL~1     SQLTELEMETRY
               0 File(s)              0 bytes
               6 Dir(s)  50,487,128,064 bytes free

명령행에서 이렇게 설정하고 다시 문제가 되었던 빌드 명령을 수행하면,

c:\temp> SET LOCALAPPDATA=C:\Users\DEFAULT~1\AppData\Local
c:\temp> SET APPDATA=C:\Users\DEFAULT~1\AppData\Roaming

c:\temp> electronize build /target win-x64 /PublishReadyToRun false

정상적으로 실행이 되는 것을 확인할 수 있습니다.




[이 글에 대해서 여러분들과 의견을 공유하고 싶습니다. 틀리거나 미흡한 부분 또는 의문 사항이 있으시면 언제든 댓글 남겨주십시오.]



donaricano-btn



[최초 등록일: ]
[최종 수정일: 8/18/2021]

Creative Commons License
이 저작물은 크리에이티브 커먼즈 코리아 저작자표시-비영리-변경금지 2.0 대한민국 라이센스에 따라 이용하실 수 있습니다.
by SeongTae Jeong, mailto:techsharer at outlook.com

비밀번호

댓글 쓴 사람
 




1  2  3  4  5  6  [7]  8  9  10  11  12  13  14  15  ...
NoWriterDateCnt.TitleFile(s)
12700정성태7/8/2021460.NET Framework: 1074. RuntimeType의 메모리 누수? [1]
12699정성태7/8/2021343VS.NET IDE: 167. Visual Studio 디버깅 중 GC Heap 상태를 보여주는 "Show Diagnostic Tools" 메뉴 사용법
12698정성태7/7/20211182오류 유형: 732. Windows 11 업데이트 시 3% 또는 0%에서 다운로드가 멈춘 경우
12697정성태7/7/2021539개발 환경 구성: 574. Windows 11 (Insider Preview) 설치하는 방법
12696정성태7/6/2021393VC++: 146. 운영체제의 스레드 문맥 교환(Context Switch)을 유사하게 구현하는 방법파일 다운로드2
12695정성태7/3/2021386VC++: 145. C 언어의 setjmp/longjmp 기능을 Thread Context를 이용해 유사하게 구현하는 방법파일 다운로드1
12694정성태7/2/2021249Java: 24. Azure - Spring Boot 앱을 Java SE(Embedded Web Server)로 호스팅 시 로그 파일 남기는 방법
12693정성태6/30/2021282오류 유형: 731. Azure Web App Site Extension - Failed to install web app extension [...]. {1}
12692정성태6/30/2021387디버깅 기술: 180. Azure - Web App의 비정상 종료 시 남겨지는 로그 확인
12691정성태6/30/2021292개발 환경 구성: 573. 테스트 용도이지만 테스트에 적합하지 않은 Azure D1 공유(shared) 요금제
12690정성태6/28/2021471Java: 23. Azure - 자바(Java)로 만드는 Web App Service - Tomcat 호스팅
12689정성태6/25/2021434오류 유형: 730. Windows Forms 디자이너 - The class Form1 can be designed, but is not the first class in the file.
12688정성태6/24/2021751.NET Framework: 1073. C# - JSON 역/직렬화 시 리플렉션 손실을 없애는 JsonSrcGen [1]파일 다운로드1
12687정성태6/22/2021297오류 유형: 729. Invalid data: Invalid artifact, java se app service only supports .jar artifact
12686정성태6/21/2021371Java: 22. Azure - 자바(Java)로 만드는 Web App Service - Java SE (Embedded Web Server) 호스팅
12685정성태6/21/2021424Java: 21. Azure Web App Service에 배포된 Java 프로세스의 메모리 및 힙(Heap) 덤프 뜨는 방법
12684정성태6/19/2021362오류 유형: 728. Visual Studio 2022부터 DTE.get_Properties 속성 접근 시 System.MissingMethodException 예외 발생
12683정성태6/18/2021506VS.NET IDE: 166. Visual Studio 2022 - Windows Forms 프로젝트의 x86 DLL 컨트롤이 Designer에서 오류가 발생하는 문제파일 다운로드1
12682정성태6/18/2021426VS.NET IDE: 165. Visual Studio 2022를 위한 Extension 마이그레이션
12681정성태6/18/2021351오류 유형: 727. .NET 2.0 ~ 3.5 + x64 환경에서 System.EnterpriseServices 참조 시 CS8012 경고
12680정성태6/18/2021395오류 유형: 726. python2.7.exe 실행 시 0xc000007b 오류
12679정성태6/18/2021399COM 개체 관련: 23. CoInitializeSecurity의 전역 설정을 재정의하는 CoSetProxyBlanket 함수 사용법파일 다운로드1
12678정성태6/17/2021423.NET Framework: 1072. C# - CoCreateInstance 관련 Inteop 오류 정리파일 다운로드1
12677정성태6/17/2021418VC++: 144. 역공학을 통한 lxssmanager.dll의 ILxssSession 사용법 분석파일 다운로드1
12676정성태6/16/2021424VC++: 143. ionescu007/lxss github repo에 공개된 lxssmanager.dll의 CLSID_LxssUserSession/IID_ILxssSession 사용법파일 다운로드1
12675정성태6/16/2021404Java: 20. maven package 명령어 결과물로 (war가 아닌) jar 생성 방법
1  2  3  4  5  6  [7]  8  9  10  11  12  13  14  15  ...